{"text_format":"1","workbook":"xlsx","n_sheets":5,"sheets":["Matriz Calificación-Evaluación","Instructivo","Matriz","Mapa Riesgo Inherente ","Mapa Riesgo Residual"],"not_rendered":{"charts":0,"images":7,"macros":1,"external_links":0,"defined_names":9,"comments":0,"pivot_tables":0},"unopened":[],"bounds":{"document_bytes":16777216,"sheet_cells":100000,"rows_first":2000,"rows_last":500,"rows_between":2000,"halvings":0,"cell_chars":16384,"cell_head_chars":4096},"cells_cut":0,"cells_raw":0,"read":"whole","date_system":"1900"}

{"sheet":"Matriz Calificación-Evaluación","index":0,"n_rows":11,"n_cols":11,"rows_kept":11,"cut":false,"hidden":true,"merged":[[1,3,1,7]]}
[]
[null,null,null,"Matriz de Calificación evaluación y respuesta a los Riesgos."]
[]
[null,null,null,null,"Impacto"]
[null,"Probabilidad",null,"Insignificante","Menor","Moderado ","Mayor ","Catastrófico"]
[null,null,null,1,2,3,4,5]
[null,"Raro",1,"B","B","M","A","A",null,"B","Zona de Riesgo Baja"]
[null,"Improbable",2,"B","B","M","A","E",null,"M","Zona de Riesgo Moderada"]
[null,"Posible ",3,"B","M","A","E","E",null,"A","Zona de Riesgo Alta"]
[null,"Probable",4,"M","A","A","E","E",null,"E","Zona de Riesgo Extrema"]
[null,"casi seguro",5,"A","A","E","E","E"]

{"sheet":"Instructivo","index":1,"n_rows":73,"n_cols":12,"rows_kept":73,"cut":false,"hidden":false,"merged":[[2,1,14,1],[3,0,14,0],[14,2,14,7],[4,2,13,7],[0,2,0,17],[2,17,91,17],[54,1,70,1],[15,0,15,16],[2,9,14,16],[28,0,28,16],[73,0,91,16],[71,0,71,16],[1,0,1,17],[0,0,0,1],[16,1,27,1],[16,2,17,7],[16,8,27,8],[24,11,24,14],[25,11,25,14],[41,11,41,14],[50,11,52,13],[2,2,3,7],[2,8,14,8],[16,9,27,9],[16,10,16,16],[22,10,22,15],[17,0,27,0],[30,2,51,7],[29,1,53,1],[29,8,53,8],[18,2,26,7],[29,9,53,9],[29,10,30,16],[30,0,53,0],[27,2,27,7],[17,10,17,15],[21,10,21,15],[18,11,18,16],[19,11,19,16],[20,11,20,16],[23,11,23,14],[54,0,70,0],[72,0,72,16],[54,2,55,16],[56,2,57,16],[58,2,58,16],[59,2,61,16],[62,2,63,15],[64,2,65,15],[66,2,70,15]]}
[null,null,"Oficina de Planeación Institucional\nlnstructivo metodología administración de Riesgos"]
[]
["PASO 1",null,null,null,null,null,null,null,null,"La Política de Adminsitración de Riesgos tiene como objetivo garantizar \nla gestión pública a través del logro de los objetivos y procesos institucionales, instaurando los principios básicos de la gestión del riesgo y el marco general para el control y gestión del riesgos, a través de la identificación, análisis, valoración e implementación de lo establecido en esta política, con el propósito de guiar a los servidores públicos y contratistas de INDEPORTES CAUCA responsables de los procesos, con el fin de tener un panorama general de las posibles desviaciones que pueden ocurrir y que crean incertidumbre sobre el logro de los objetivos de los procesos e institucionales"]
[]
[null,null,"POLITICA DE ADMINISTRACIÓN DEL RIESGO\n"]
[]
[]
[]
[]
[]
[]
[]
[]
[]
[]
[]
["PASO 2"]
[null,null,null,null,null,null,null,null,null,null,"2.1 Establecimiento del contexto"]
[null,null,"IDENTIFICACIÓN DEL RIESGO",null,null,null,null,null,null,null,null,"Establecimiento del contexto interno"]
[null,null,null,null,null,null,null,null,null,null,null,"Establecimiento del contexto externo"]
[null,null,null,null,null,null,null,null,null,null,null,"Establecimiento del contexto del proceso"]
[]
[null,null,null,null,null,null,null,null,null,null,"2.1 Identificación del riesgo"]
[null,null,null,null,null,null,null,null,null,null,null,"Causas o factores "]
[null,null,null,null,null,null,null,null,null,null,null,"Tipos de Riesgos"]
[null,null,null,null,null,null,null,null,null,null,null,"Consecuencias o efectos"]
[]
[]
[]
["ETAPA 3"]
["Valoración\ndel Riesgo",null,"VALORACIÓN  DEL RIESGO"]
[]
[]
[]
[]
[]
[]
[]
[]
[]
[]
[null,null,null,null,null,null,null,null,null,null,null,"Calificar la Probabilidad"]
[]
[]
[]
[]
[]
[]
[]
[]
[null,null,null,null,null,null,null,null,null,null,null,"ZONAS DE RESULTADO"]
[]
[]
[]
["MARCO CONCEPTUAL",null,"Riesgo: Posibilidad de que ocurra un acontecimiento que impacte el alcance de los objetivos y resultados de la Institución "]
[]
[null,null,"Descripción: se refiere a las características generales o las formas en que se observa o manifiesta el riesgo identificado."]
[]
[null,null,"Efecto: Corresponde a las consecuencias ocasionadas por el riesgo."]
[null,null,"Causas:  Es lo que origina el riesgo, son el punto de partida para el planteamiento de acciones preventivas. Las causas se deben establecer a partir de los factores internos y externos que se establecieron en el contexto. Para determinar las causas se podrá utilizar el diagrama causa - efecto."]
[]
[]
[null,null,"Una vez ubicados los riesgos en la matriz de priorización, se identifica si existen controles asociados, si son aplicados, están documentados y son efectivos, con el fin de determinar la posición del riesgo en la matriz de vulnerabilidad."]
[]
[null,null,"Control:  Es toda acción que tiende a prevenir o mitigar los riesgos, significa analizar el desempeño de los procesos, evidenciando posibles desviaciones frente al resultado esperado. Los controles proporcionan un modelo operacional de seguridad razonable en el logro de los objetivos. Tipos:"]
[]
[null,null,"Tipos de Control:\nDetectivo: se diseñan para identificar si resultados indeseables han ocurrido después de un acontecimiento.\nPreventivo: aquellos que actúan para eliminar las causas del riesgo, para prevenir su ocurrencia o materialización.\nCorrectivos: aquellos que permiten el restablecimiento de la actividad después de ser detectado un evento no deseable; también permiten la modificación de las acciones que propiciaron su ocurrencia."]
[]
[]
[]
[]
[]
["Algunas de las acciones tienden  a controlar la Posibilidad/Probabilidad y otras el impacto Son:"]

{"sheet":"Matriz","index":2,"n_rows":251,"n_cols":96,"rows_kept":251,"cut":false,"hidden":false,"merged":[[116,37,124,37],[116,21,124,21],[116,22,124,22],[116,23,124,23],[116,24,124,24],[116,25,124,25],[6,33,6,34],[6,35,6,37],[116,26,124,26],[116,27,124,27],[107,2,115,2],[107,4,115,4],[107,12,115,12],[107,13,115,13],[107,14,115,14],[107,15,115,15],[107,16,115,16],[107,17,115,17],[98,32,106,32],[98,33,106,33],[98,34,106,34],[116,28,124,28],[116,29,124,29],[98,28,106,28],[98,29,106,29],[0,0,3,2],[98,14,106,14],[98,15,106,15],[98,16,106,16],[116,31,124,31],[116,32,124,32],[116,33,124,33],[116,34,124,34],[116,35,124,35],[116,36,124,36],[53,27,61,27],[53,28,61,28],[53,29,61,29],[107,18,115,18],[107,19,115,19],[107,20,115,20],[107,21,115,21],[107,22,115,22],[107,23,115,23],[107,24,115,24],[107,25,115,25],[107,26,115,26],[116,11,124,11],[89,14,97,14],[89,15,97,15],[89,16,97,16],[89,39,97,39],[80,37,88,37],[80,39,88,39],[80,30,88,30],[80,21,88,21],[98,17,106,17],[98,18,106,18],[98,19,106,19],[98,20,106,20],[98,21,106,21],[98,22,106,22],[98,23,106,23],[98,24,106,24],[98,25,106,25],[98,26,106,26],[98,27,106,27],[80,38,88,38],[62,31,70,31],[62,32,70,32],[0,38,3,47],[89,29,97,29],[80,28,88,28],[80,29,88,29],[80,20,88,20],[80,18,88,18],[80,22,88,22],[89,35,97,35],[89,36,97,36],[89,37,97,37],[80,24,88,24],[80,25,88,25],[80,26,88,26],[80,27,88,27],[80,19,88,19],[62,27,70,27],[62,28,70,28],[62,29,70,29],[62,30,70,30],[62,38,70,38],[80,41,88,41],[71,31,79,31],[71,32,79,32],[0,3,3,37],[4,19,4,40],[80,40,88,40],[62,33,70,33],[53,39,61,39],[62,39,70,39],[62,20,70,20],[62,21,70,21],[62,22,70,22],[98,35,106,35],[98,36,106,36],[98,37,106,37],[98,39,106,39],[98,30,106,30],[98,31,106,31],[89,30,97,30],[89,31,97,31],[89,32,97,32],[89,33,97,33],[89,34,97,34],[71,29,79,29],[62,23,70,23],[62,24,70,24],[62,25,70,25],[62,26,70,26],[71,33,79,33],[71,34,79,34],[71,35,79,35],[71,36,79,36],[71,37,79,37],[71,39,79,39],[80,31,88,31],[80,32,88,32],[80,33,88,33],[80,34,88,34],[80,35,88,35],[80,36,88,36],[71,30,79,30],[53,30,61,30],[53,31,61,31],[53,2,61,2],[53,4,61,4],[53,17,61,17],[53,18,61,18],[53,19,61,19],[53,20,61,20],[53,21,61,21],[53,16,61,16],[80,12,88,12],[80,13,88,13],[80,14,88,14],[80,15,88,15],[80,16,88,16],[80,17,88,17],[53,32,61,32],[80,23,88,23],[62,2,70,2],[62,4,70,4],[62,12,70,12],[62,13,70,13],[62,14,70,14],[62,15,70,15],[62,16,70,16],[62,17,70,17],[62,18,70,18],[62,8,70,8],[62,9,70,9],[62,10,70,10],[62,11,70,11],[62,19,70,19],[53,22,61,22],[44,27,52,27],[44,28,52,28],[44,29,52,29],[53,33,61,33],[53,34,61,34],[53,35,61,35],[53,36,61,36],[53,37,61,37],[71,12,79,12],[71,13,79,13],[71,14,79,14],[71,15,79,15],[71,16,79,16],[71,17,79,17],[71,18,79,18],[71,19,79,19],[71,20,79,20],[71,21,79,21],[71,22,79,22],[71,23,79,23],[71,24,79,24],[71,25,79,25],[71,26,79,26],[53,12,61,12],[53,13,61,13],[53,14,61,14],[53,15,61,15],[53,23,61,23],[53,24,61,24],[53,25,61,25],[53,26,61,26],[44,30,52,30],[35,2,43,2],[35,4,43,4],[35,12,43,12],[35,13,43,13],[35,14,43,14],[35,15,43,15],[35,16,43,16],[35,17,43,17],[35,18,43,18],[35,19,43,19],[35,20,43,20],[35,21,43,21],[35,22,43,22],[35,23,43,23],[35,24,43,24],[35,25,43,25],[35,26,43,26],[44,14,52,14],[44,15,52,15],[44,16,52,16],[44,17,52,17],[44,18,52,18],[44,19,52,19],[44,20,52,20],[44,21,52,21],[44,22,52,22],[44,23,52,23],[44,24,52,24],[44,25,52,25],[44,26,52,26],[26,20,34,20],[26,21,34,21],[26,22,34,22],[26,23,34,23],[26,24,34,24],[26,25,34,25],[26,26,34,26],[26,27,34,27],[26,28,34,28],[26,29,34,29],[17,30,25,30],[17,31,25,31],[17,32,25,32],[17,33,25,33],[17,34,25,34],[17,35,25,35],[26,30,34,30],[26,31,34,31],[26,32,34,32],[26,33,34,33],[26,34,34,34],[26,35,34,35],[17,12,25,12],[17,13,25,13],[17,14,25,14],[17,15,25,15],[17,16,25,16],[17,17,25,17],[17,18,25,18],[17,19,25,19],[17,20,25,20],[17,21,25,21],[17,22,25,22],[17,23,25,23],[17,24,25,24],[17,25,25,25],[17,26,25,26],[17,27,25,27],[17,28,25,28],[233,72,233,76],[206,38,214,38],[206,40,214,40],[206,43,214,43],[206,44,214,44],[206,45,214,45],[206,46,214,46],[206,47,214,47],[215,38,223,38],[215,40,223,40],[215,43,223,43],[170,47,178,47],[179,38,187,38],[179,40,187,40],[179,43,187,43],[179,44,187,44],[8,36,16,36],[8,37,16,37],[8,39,16,39],[8,41,16,41],[8,42,16,42],[35,36,43,36],[35,37,43,37],[35,39,43,39],[35,41,43,41],[62,36,70,36],[62,37,70,37],[80,42,88,42],[98,41,106,41],[98,42,106,42],[89,41,97,41],[89,42,97,42],[215,45,223,45],[215,46,223,46],[215,47,223,47],[188,44,196,44],[188,45,196,45],[188,46,196,46],[188,47,196,47],[152,10,160,10],[161,10,169,10],[170,10,178,10],[179,10,187,10],[188,10,196,10],[197,10,205,10],[206,10,214,10],[215,10,223,10],[188,11,196,11],[197,11,205,11],[206,11,214,11],[215,11,223,11],[152,11,160,11],[161,11,169,11],[170,11,178,11],[179,11,187,11],[152,15,160,15],[152,16,160,16],[152,20,160,20],[152,21,160,21],[152,22,160,22],[152,23,160,23],[161,32,169,32],[161,27,169,27],[161,28,169,28],[134,47,142,47],[116,45,124,45],[116,46,124,46],[116,39,124,39],[116,41,124,41],[116,42,124,42],[197,43,205,43],[197,44,205,44],[197,45,205,45],[197,46,205,46],[197,47,205,47],[188,38,196,38],[143,47,151,47],[152,38,160,38],[152,40,160,40],[152,43,160,43],[152,44,160,44],[152,45,160,45],[152,46,160,46],[152,47,160,47],[161,47,169,47],[161,43,169,43],[161,44,169,44],[161,45,169,45],[188,43,196,43],[143,38,151,38],[179,45,187,45],[179,46,187,46],[179,47,187,47],[125,42,133,42],[197,42,205,42],[143,40,151,40],[143,43,151,43],[143,44,151,44],[143,45,151,45],[143,46,151,46],[170,38,178,38],[170,40,178,40],[170,43,178,43],[170,44,178,44],[170,45,178,45],[170,46,178,46],[143,41,151,41],[143,42,151,42],[161,41,169,41],[161,42,169,42],[161,46,169,46],[161,38,169,38],[161,40,169,40],[143,39,151,39],[152,41,160,41],[152,42,160,42],[161,39,169,39],[152,39,160,39],[134,0,142,0],[143,0,151,0],[152,0,160,0],[161,0,169,0],[188,3,196,3],[188,5,196,5],[116,7,124,7],[125,7,133,7],[134,7,142,7],[143,7,151,7],[152,7,160,7],[161,7,169,7],[170,7,178,7],[179,7,187,7],[188,7,196,7],[6,38,6,47],[44,46,52,46],[53,46,61,46],[17,45,25,45],[17,47,25,47],[26,45,34,45],[26,47,34,47],[35,45,43,45],[35,47,43,47],[53,43,61,43],[53,44,61,44],[35,44,43,44],[17,43,25,43],[17,44,25,44],[26,43,34,43],[26,44,34,44],[44,47,52,47],[134,43,142,43],[8,83,9,83],[7,16,7,17],[7,18,7,19],[7,20,7,21],[7,22,7,23],[7,24,7,25],[8,69,8,70],[8,60,8,62],[8,64,8,67],[8,43,16,43],[8,44,16,44],[8,45,16,45],[8,47,16,47],[8,46,16,46],[8,40,16,40],[7,26,7,27],[7,28,7,29],[8,16,16,16],[8,17,16,17],[53,47,61,47],[134,44,142,44],[134,45,142,45],[134,46,142,46],[116,47,124,47],[125,38,133,38],[125,40,133,40],[125,43,133,43],[125,44,133,44],[125,45,133,45],[125,46,133,46],[125,47,133,47],[107,47,115,47],[116,38,124,38],[116,40,124,40],[116,43,124,43],[116,44,124,44],[62,45,70,45],[107,43,115,43],[107,44,115,44],[107,45,115,45],[107,46,115,46],[17,36,25,36],[17,37,25,37],[26,36,34,36],[26,37,34,37],[26,42,34,42],[35,27,43,27],[35,28,43,28],[35,29,43,29],[35,30,43,30],[35,31,43,31],[35,32,43,32],[35,33,43,33],[35,34,43,34],[35,35,43,35],[44,31,52,31],[44,32,52,32],[44,33,52,33],[44,34,52,34],[44,35,52,35],[44,36,52,36],[44,37,52,37],[44,39,52,39],[8,19,16,19],[8,20,16,20],[8,21,16,21],[8,28,16,28],[8,29,16,29],[8,30,16,30],[8,31,16,31],[8,32,16,32],[8,33,16,33],[8,34,16,34],[8,35,16,35],[35,46,43,46],[53,38,61,38],[44,43,52,43],[44,44,52,44],[53,40,61,40],[8,25,16,25],[17,46,25,46],[26,46,34,46],[8,38,16,38],[26,38,34,38],[26,40,34,40],[17,38,25,38],[17,40,25,40],[17,41,25,41],[17,42,25,42],[26,39,34,39],[26,41,34,41],[17,29,25,29],[8,27,16,27],[17,39,25,39],[26,19,34,19],[44,45,52,45],[44,38,52,38],[44,40,52,40],[35,38,43,38],[35,40,43,40],[35,43,43,43],[80,46,88,46],[53,45,61,45],[35,42,43,42],[53,41,61,41],[53,42,61,42],[71,41,79,41],[71,42,79,42],[107,38,115,38],[107,40,115,40],[89,45,97,45],[62,41,70,41],[62,42,70,42],[107,41,115,41],[107,42,115,42],[89,44,97,44],[80,43,88,43],[80,44,88,44],[80,45,88,45],[71,38,79,38],[71,40,79,40],[71,43,79,43],[71,44,79,44],[71,45,79,45],[71,46,79,46],[44,41,52,41],[44,42,52,42],[125,11,133,11],[134,11,142,11],[107,32,115,32],[107,33,115,33],[107,34,115,34],[107,35,115,35],[107,36,115,36],[107,37,115,37],[107,39,115,39],[125,14,133,14],[125,15,133,15],[125,16,133,16],[116,12,124,12],[116,13,124,13],[116,14,124,14],[116,15,124,15],[116,16,124,16],[116,17,124,17],[116,18,124,18],[116,19,124,19],[116,20,124,20],[134,36,142,36],[134,38,142,38],[107,27,115,27],[107,28,115,28],[107,29,115,29],[107,30,115,30],[107,31,115,31],[134,19,142,19],[134,20,142,20],[134,21,142,21],[134,39,142,39],[235,2,235,3],[234,4,234,37],[233,4,233,37],[233,2,233,3],[234,2,234,3],[143,3,151,3],[152,3,160,3],[107,8,115,8],[116,8,124,8],[125,8,133,8],[134,8,142,8],[143,8,151,8],[152,8,160,8],[161,8,169,8],[170,8,178,8],[179,8,187,8],[188,8,196,8],[197,8,205,8],[206,8,214,8],[215,8,223,8],[224,3,232,3],[107,7,115,7],[107,5,115,5],[116,5,124,5],[125,5,133,5],[107,3,115,3],[116,3,124,3],[152,9,160,9],[161,9,169,9],[170,9,178,9],[197,7,205,7],[116,30,124,30],[4,0,4,1],[6,0,6,1],[4,14,4,18],[4,4,4,12],[44,3,52,3],[26,3,34,3],[35,7,43,7],[44,6,52,6],[35,5,43,5],[44,5,52,5],[35,6,43,6],[26,5,34,5],[26,6,34,6],[17,0,25,0],[8,0,16,0],[8,2,16,2],[8,4,16,4],[6,12,6,32],[8,3,16,3],[17,5,25,5],[17,6,25,6],[8,6,16,6],[26,8,34,8],[8,7,16,7],[17,7,25,7],[26,7,34,7],[26,9,34,9],[8,11,16,11],[17,11,25,11],[26,11,34,11],[8,12,16,12],[8,15,16,15],[8,22,16,22],[8,23,16,23],[8,24,16,24],[17,9,25,9],[8,8,16,8],[8,10,16,10],[26,10,34,10],[8,26,16,26],[17,3,25,3],[53,9,61,9],[8,5,16,5],[6,2,6,4],[7,8,7,9],[17,8,25,8],[17,2,25,2],[53,3,61,3],[53,5,61,5],[53,6,61,6],[53,7,61,7],[17,4,25,4],[26,2,34,2],[26,4,34,4],[35,9,43,9],[6,5,6,11],[44,11,52,11],[7,5,7,6],[7,10,7,11],[17,10,25,10],[53,8,61,8],[44,2,52,2],[44,4,52,4],[8,18,16,18],[80,0,88,0],[80,3,88,3],[80,5,88,5],[80,6,88,6],[80,7,88,7],[80,8,88,8],[80,9,88,9],[80,10,88,10],[80,11,88,11],[89,10,97,10],[89,11,97,11],[89,38,97,38],[89,40,97,40],[89,43,97,43],[62,47,70,47],[71,0,79,0],[71,47,79,47],[62,0,70,0],[62,3,70,3],[62,5,70,5],[62,6,70,6],[62,43,70,43],[62,34,70,34],[62,35,70,35],[62,40,70,40],[89,2,97,2],[89,4,97,4],[71,4,79,4],[62,46,70,46],[71,2,79,2],[71,27,79,27],[71,28,79,28],[161,3,169,3],[170,3,178,3],[179,3,187,3],[206,3,214,3],[107,6,115,6],[152,5,160,5],[161,5,169,5],[170,5,178,5],[215,6,223,6],[134,6,142,6],[143,6,151,6],[152,6,160,6],[215,3,223,3],[8,13,16,13],[8,14,16,14],[62,44,70,44],[80,47,88,47],[89,3,97,3],[89,5,97,5],[89,6,97,6],[89,7,97,7],[89,8,97,8],[89,9,97,9],[116,6,124,6],[125,6,133,6],[98,4,106,4],[8,9,16,9],[197,38,205,38],[197,40,205,40],[116,10,124,10],[125,10,133,10],[125,22,133,22],[89,46,97,46],[89,47,97,47],[98,0,106,0],[98,3,106,3],[98,5,106,5],[98,6,106,6],[98,7,106,7],[98,8,106,8],[98,9,106,9],[98,10,106,10],[98,11,106,11],[98,38,106,38],[98,40,106,40],[98,43,106,43],[98,44,106,44],[98,45,106,45],[98,46,106,46],[98,47,106,47],[89,0,97,0],[98,2,106,2],[89,17,97,17],[89,18,97,18],[89,19,97,19],[89,20,97,20],[89,21,97,21],[89,22,97,22],[89,23,97,23],[89,24,97,24],[89,25,97,25],[89,26,97,26],[89,27,97,27],[89,28,97,28],[224,45,232,45],[224,46,232,46],[224,47,232,47],[224,0,232,0],[224,6,232,6],[224,7,232,7],[224,8,232,8],[224,9,232,9],[224,10,232,10],[224,11,232,11],[224,43,232,43],[224,44,232,44],[215,32,223,32],[215,33,223,33],[215,34,223,34],[215,35,223,35],[215,36,223,36],[215,37,223,37],[215,39,223,39],[215,41,223,41],[215,42,223,42],[224,5,232,5],[215,5,223,5],[215,7,223,7],[215,9,223,9],[215,31,223,31],[224,2,232,2],[224,4,232,4],[224,12,232,12],[224,13,232,13],[215,0,223,0],[215,44,223,44],[170,0,178,0],[179,0,187,0],[188,0,196,0],[197,0,205,0],[206,0,214,0],[197,3,205,3],[197,5,205,5],[179,6,187,6],[179,5,187,5],[197,6,205,6],[206,6,214,6],[206,5,214,5],[179,9,187,9],[188,9,196,9],[197,9,205,9],[206,9,214,9],[188,6,196,6],[170,6,178,6],[170,2,178,2],[170,4,178,4],[206,2,214,2],[206,4,214,4],[206,7,214,7],[197,2,205,2],[197,4,205,4],[134,10,142,10],[143,10,151,10],[125,2,133,2],[125,4,133,4],[125,12,133,12],[125,13,133,13],[53,10,61,10],[53,11,61,11],[35,11,43,11],[44,9,52,9],[35,8,43,8],[44,8,52,8],[44,10,52,10],[35,10,43,10],[44,12,52,12],[44,13,52,13],[89,12,97,12],[89,13,97,13],[98,12,106,12],[98,13,106,13],[125,3,133,3],[134,3,142,3],[134,5,142,5],[107,10,115,10],[107,9,115,9],[116,9,124,9],[125,9,133,9],[134,9,142,9],[143,9,151,9],[80,2,88,2],[80,4,88,4],[107,11,115,11],[35,0,43,0],[44,0,52,0],[44,7,52,7],[35,3,43,3],[125,18,133,18],[125,19,133,19],[125,20,133,20],[125,21,133,21],[107,0,115,0],[116,0,124,0],[125,0,133,0],[26,12,34,12],[26,13,34,13],[26,14,34,14],[26,15,34,15],[71,3,79,3],[71,5,79,5],[71,6,79,6],[71,7,79,7],[71,8,79,8],[71,9,79,9],[71,10,79,10],[71,11,79,11],[26,16,34,16],[26,17,34,17],[26,18,34,18],[62,7,70,7],[53,0,61,0],[26,0,34,0],[116,2,124,2],[116,4,124,4],[125,17,133,17],[134,2,142,2],[134,4,142,4],[134,12,142,12],[134,13,142,13],[134,14,142,14],[134,15,142,15],[134,16,142,16],[134,17,142,17],[134,18,142,18],[125,32,133,32],[125,33,133,33],[125,34,133,34],[125,35,133,35],[125,36,133,36],[125,37,133,37],[125,39,133,39],[125,41,133,41],[125,23,133,23],[125,24,133,24],[125,25,133,25],[125,26,133,26],[125,27,133,27],[125,28,133,28],[125,29,133,29],[125,30,133,30],[125,31,133,31],[134,30,142,30],[134,31,142,31],[134,32,142,32],[134,33,142,33],[134,34,142,34],[134,35,142,35],[143,2,151,2],[143,4,151,4],[143,12,151,12],[143,13,151,13],[143,14,151,14],[143,15,151,15],[143,16,151,16],[143,17,151,17],[143,18,151,18],[143,19,151,19],[143,20,151,20],[143,21,151,21],[143,22,151,22],[143,23,151,23],[143,24,151,24],[143,25,151,25],[143,26,151,26],[143,5,151,5],[134,41,142,41],[134,42,142,42],[143,30,151,30],[134,40,142,40],[143,32,151,32],[143,33,151,33],[143,11,151,11],[152,17,160,17],[152,18,160,18],[152,19,160,19],[143,34,151,34],[143,35,151,35],[143,27,151,27],[143,28,151,28],[143,29,151,29],[134,28,142,28],[134,29,142,29],[143,37,151,37],[152,32,160,32],[152,33,160,33],[152,34,160,34],[152,35,160,35],[152,36,160,36],[161,33,169,33],[161,34,169,34],[161,35,169,35],[161,36,169,36],[161,37,169,37],[152,37,160,37],[161,30,169,30],[161,31,169,31],[134,22,142,22],[134,23,142,23],[134,24,142,24],[134,25,142,25],[134,26,142,26],[134,27,142,27],[143,36,151,36],[134,37,142,37],[161,17,169,17],[161,18,169,18],[161,19,169,19],[161,20,169,20],[161,21,169,21],[161,22,169,22],[161,23,169,23],[161,24,169,24],[161,25,169,25],[161,26,169,26],[161,6,169,6],[143,31,151,31],[161,29,169,29],[152,28,160,28],[152,29,160,29],[152,30,160,30],[152,31,160,31],[152,2,160,2],[152,4,160,4],[152,12,160,12],[170,36,178,36],[170,19,178,19],[170,20,178,20]],"merged_total":1210,"flags":["merged_cut"]}
[null,null,null,"\nMAPA DE RIESGOS DE CORRUPCIÓN",null,null,null,null,null,null,null,null,null,null,null,null,null,null,null,null,null,null,null,null,null,null,null,null,null,null,null,null,null,null,null,null,null,null,"ESTA OPCION SE  OCULTA, LA INFORMACIÓN SE REFLEJA DE FORMA  AUTOMATICA EN LA HOJA DE RIESGO RESIDUAL"]
[]
[]
[]
["PROCESO",null,"Todos los procesos Institucionales","OBJETIVO","Identificar y prevenir los riesgos de corrupción presentes en la entidad, por medio de alarmas y la elaboración de mecanismos orientados a prevenirlos o evitarlos.",null,null,null,null,null,null,null,null,"ALCANCE","Aplica para todos los procesos Institucionales"]
[]
["PROCESOS",null,"IDENTIFICACION DEL RIESGO",null,null,"ANALISIS DEL RIESGO",null,null,null,null,null,null,"VALORACIÓN/EVALUACIÒN DEL RIESGO",null,null,null,null,null,null,null,null,null,null,null,null,null,null,null,null,null,null,null,null,"ACCIONES",null,"SEGUIMIENTOS EN LA VIGENCIA - 2025"]
["PROCESO","N°","CAUSA","RIESGO","CONSECUENCIAS","PROBABILIDAD",null,null,"IMPACTO",null,"NIVEL DE RIESGO","CONTEO NIVEL DE RIESGO","TIPO DE CONTROL","CONTROL ESTABLECIDO\n","FRECUENCIA DEL CONTROL","El control previene la materialización del riesgo (afecta probabilidad) o permite enfrentar la situación en caso de materialización (afecta impacto)?","¿Existen  un responsable asignado a la ejecución del control?",null,"¿El responsable tiene autoridad y adecuada segregación de funciones en la ejecución del control?",null,"Periodicidad",null,"Propósito",null,"Como se realiza la actividad de control",null,"Que pasa con las observaciones o desviaciones",null,"Evidencia de la Ejecución del Control",null,"TOTAL","Efectos en la  Probabilidad/Impacto","Valor del Impacto","PLAN DE ACCIÓN","RESPONSABLE","ABRIL","AGOSTO","DICIEMBRE","PROBABILIDAD","PROBABILIDAD AJUSTADA","IMPACTO","IMPACTO AJUSTADO","Nuevo nivel de Desplazamiento en Probabilidad/Impacto","NUMERO TOTAL DE DESPLAZAMIENTOS POR PROBABILIDAD","NUMERO TOTAL DE DESPLAZAMIENTOS POR IMPACTO","PROBABILIDAD CON DEZPLAZAMIENTOS","TOTAL","IMPACTO CON DESPLAZAMIENTOS"]
["R1\nDIRECCIÓN ESTRATÉGICA",1,"No dar a conocer a las personas los limites de las acciones y decisiones\nPorque se tiene una posición de privilegio por el poder que se ostenta.","Posibilidad de Concentración de autoridad o exceso de poder","Toma de Decisiones Arbitrarias\nAbuso de Poder\nPerdida de Transparencia\nClima Organizacional Deteriorado",2,{"$f":"IF(F9=5,\"Mas de una vez al año\",IF(F9=4,\"Al menos una vez en el ultimo año\",IF(F9=3,\"Al menos una vez en los ultimos 2 años\",IF(F9=2,\"Al menos una vez en los ultimos 5 años\",\"No se ha presentado en los ultimos 5 años\"))))","v":"Al menos una vez en los ultimos 5 años"},{"$f":"CONCATENATE(F$9,I$9)","v":"24"},4,{"$f":"IF(I9=5,\"Catastrófico\",IF(I9=4,\"Mayor\",IF(I9=3,\"Moderado\",IF(I9=2,\"Menor\",IF(I9=1,\"Leve\",\"Digite Valor entre 1 y 5\")))))","v":"Mayor"},{"$f":"IF(J9=\"Digite Valor entre 1 y 5\",\"\",IF(COUNTIF(BU$236:BU$243,CONCATENATE(F9,I9)),BU$235,IF(COUNTIF(BV$236:BV$243,CONCATENATE(F9,I9)),BV$235,IF(COUNTIF(BW$236:BW$239,CONCATENATE(F9,I9)),BW$235,BX$235))))","v":"Zona de Riesgo Alta"},{"$f":"IF(K9=BU$235,\"E\",IF(K9=BV$235,\"A\",IF(K9=BW$235,\"M\",IF(K9=BX$235,\"B\",\"\"))))","v":"A"},"Control Preventivo","1. Cumplimiento al manual de Procesos y procedimientos\n2. Verificar el manual de funciones\n3. Verificar el código de integridad institucional\n4. Comunicar a través de la página web y redes sociales los resultados de la Gestión\n","Continuo","Afecta la Probabilidad","Si",{"$f":"IF(Q9=\"Si\",15,0)","v":15},"Si",{"$f":"IF(S9=\"Si\",15,0)","v":15},"Oportuna",{"$f":"IF(U9=\"Oportuna\",15,0)","v":15},"Prevenir",{"$f":"IF(W9=\"Prevenir\",15,10)","v":15},"Confiable",{"$f":"IF(Y9=\"confiable\",15,0)","v":15},"Se investigan",{"$f":"IF(AA9=\"Se investigan\",15,0)","v":15},"Completa ",{"$f":"IF(AC9=\"Completa \",10,5)","v":10},{"$f":"R9+T9+V9+X9+Z9+AB9+AD9","v":100},{"$f":"IF(P9=\"\",\"\",IF(P9=\"Afecta la Probabilidad\",IF(AND(AE9>=0,AE9<=50),\"No disminuye la Probabilidad\",IF(AND(AE9>50,AE9<=75),\"Disminuye la Probabilidad en 1\",IF(AND(AE9>75,AE9<=100),\"Disminuye la Probabilidad en 2\",\"\"))),IF(AND(AE9>=0,AE9<=50),\"No disminuye el Impacto\",IF(AND(AE9>50,AE9<=75),\"Disminuye el Impacto en 1\",IF(AND(AE9>75,AE9<=100),\"Disminuye el Impacto en 2\",\"\")))))","v":"Disminuye la Probabilidad en 2"},{"$f":"IF(AE9<=50,0,IF(AND(AE9>50,AE9<=75),1,IF(AND(AE9>75,AE9<=100),2,\"\")))","v":2},"1. Aplicación de los procedimientos por proceso\n2. Aplicación del manual de Funciones\n3. Aplicar los valores institucionales\n4. Publicar en la página institucional  y redes sociales los resultados de la Gestión Institucional","Gerencia\nJefe Planeación Institucional",null,null,null,{"$f":"F9","v":2},{"$f":"IF(P9=\"Afecta la Probabilidad\",AM9-(AM9-AG9),\"No aplica\")","v":2},{"$f":"I9","v":4},{"$f":"IF(P9=\"Afecta el Impacto\",AO9-(AO9-AG9),\"No aplica\")","v":"No aplica"},{"$f":"IF(Matriz!P9=\"Afecta el Impacto\",CONCATENATE(AM9,AP9),CONCATENATE(AN9,AO9))","v":"24"},{"$f":"IF(P9=\"\",\"\",SUMIF(P9:P17,\"Afecta la Probabilidad\",AN9:AN17))","v":2},{"$f":"IF(P9=\"\",\"\",SUMIF(P9:P17,\"Afecta el Impacto\",AP9:AP17))","v":0},{"$f":"IF(AR9=\"\",\"\",IF(F9-AR9<=0,1,F9-AR9))","v":1},{"$f":"CONCATENATE(AT9,AV9)","v":"14"},{"$f":"IF(I9=\"\",\"\",IF(I9-AS9<0,1,I9-AS9))","v":4},null,null,null,null,null,null,null,null,null,null,null,null,null,null,null,null,null,null,null,null,null,null,null,null,null,null,null,null,null,null,null,null,null,null,null,null,null,null,null,null,null,null,null,null,null,null,"TIPO DE CONTROL","DESCRIPCIÓN TIPO DE CONTROL"]
[null,{"$f":"B9+1","v":2},null,null,null,null,null,null,null,null,null,null,null,null,null,null,null,null,null,null,null,null,null,null,null,null,null,null,null,null,null,null,null,null,null,null,null,null,null,null,null,null,null,null,null,null,null,null,null,null,null,null,null,null,null,null,null,null,null,null,null,null,null,null,null,null,null,null,null,null,null,null,null,null,null,null,null,null,null,null,null,null,null,null,null,null,null,null,null,null,null,null,null,null,"Control Preventivo"]
[null,{"$f":"B10+1","v":3},null,null,null,null,null,null,null,null,null,null,null,null,null,null,null,null,null,null,null,null,null,null,null,null,null,null,null,null,null,null,null,null,null,null,null,null,null,null,null,null,null,null,null,null,null,null,null,null,null,null,null,null,null,null,null,null,null,null,null,null,null,null,null,null,null,null,null,null,null,null,null,null,null,null,null,null,null,null,null,null,null,null,null,null,null,null,null,null,null,null,null,null,"Control Correctivo"]
[null,4,null,null,null,null,null,null,null,null,null,null,null,null,null,null,null,null,null,null,null,null,null,null,null,null,null,null,null,null,null,null,null,null,null,null,null,null,null,null,null,null,null,null,null,null,null,null,null,null,null,null,null,null,null,null,null,null,null,null,null,null,null,null,null,null,null,null,null,null,null,null,null,null,null,null,null,null,null,null,null,null,null,null,null,null,null,null,null,null,null,null,null,null,"Control Detectivo"]
[null,5]
[null,6]
[null,7]
[null,8]
[null,9]
["R2\nDIRECCIÓN ESTRATÉGICA",1,"No exista idoneidad y competitividad en el desarrollo de la misión de la Institución; Favorecimiento a terceros, conflicto de intereses.","Posibilidad de influir en la toma de decisiones  y tráfico de influencias \n(Conflictos de Interés)","Daño a la reputación\nDesviación de los Objetivos Organizacionales\nFavorecimiento de un tercero en detrimento de los principios de la función pública \nSanciones disciplinarias\nAfecta la igualdad de acceso al empleo público\nDemandas al Instituto",2,{"$f":"IF(F18=5,\"Mas de una vez al año\",IF(F18=4,\"Al menos una vez en el ultimo año\",IF(F18=3,\"Al menos una vez en los ultimos 2 años\",IF(F18=2,\"Al menos una vez en los ultimos 5 años\",\"No se ha presentado en los ultimos 5 años\"))))","v":"Al menos una vez en los ultimos 5 años"},{"$f":"CONCATENATE(F$18,I$18)","v":"24"},4,{"$f":"IF(I18=5,\"Catastrófico\",IF(I18=4,\"Mayor\",IF(I18=3,\"Moderado\",IF(I18=2,\"Menor\",IF(I18=1,\"Leve\",\"Digite Valor entre 1 y 5\")))))","v":"Mayor"},{"$f":"IF(J18=\"Digite Valor entre 1 y 5\",\"\",IF(COUNTIF(BU$236:BU$243,CONCATENATE(F18,I18)),BU$235,IF(COUNTIF(BV$236:BV$243,CONCATENATE(F18,I18)),BV$235,IF(COUNTIF(BW$236:BW$239,CONCATENATE(F18,I18)),BW$235,BX$235))))","v":"Zona de Riesgo Alta"},{"$f":"IF(K18=BU$235,\"E\",IF(K18=BV$235,\"A\",IF(K18=BW$235,\"M\",IF(K18=BX$235,\"B\",\"\"))))","v":"A"},"Control Preventivo","1. Aplicar el Manual de Funciones\n2. Aplicar el procedimiento de Selección y Vinculación de Personal\n3. Verificar el código de Integridad \n4. Realizar Contratos Prestación de Servicios\n","A Solicitud","Afecta la Probabilidad","Si",{"$f":"IF(Q18=\"Si\",15,0)","v":15},"Si",{"$f":"IF(S18=\"Si\",15,0)","v":15},"Oportuna",{"$f":"IF(U18=\"Oportuna\",15,0)","v":15},"Prevenir",{"$f":"IF(W18=\"Prevenir\",15,10)","v":15},"Confiable",{"$f":"IF(Y18=\"confiable\",15,0)","v":15},"Se investigan",{"$f":"IF(AA18=\"Se investigan\",15,0)","v":15},"Completa ",{"$f":"IF(AC18=\"Completa \",10,5)","v":10},{"$f":"R18+T18+V18+X18+Z18+AB18+AD18","v":100},{"$f":"IF(P18=\"\",\"\",IF(P18=\"Afecta la Probabilidad\",IF(AND(AE18>=0,AE18<=50),\"No disminuye la Probabilidad\",IF(AND(AE18>50,AE18<=75),\"Disminuye la Probabilidad en 1\",IF(AND(AE18>75,AE18<=100),\"Disminuye la Probabilidad en 2\",\"\"))),IF(AND(AE18>=0,AE18<=50),\"No disminuye el Impacto\",IF(AND(AE18>50,AE18<=75),\"Disminuye el Impacto en 1\",IF(AND(AE18>75,AE18<=100),\"Disminuye el Impacto en 2\",\"\")))))","v":"Disminuye la Probabilidad en 2"},{"$f":"IF(AE18<=50,0,IF(AND(AE18>50,AE18<=75),1,IF(AND(AE18>75,AE18<=100),2,\"\")))","v":2},"1. Realizar la verificación de los requisitos establecidos en el Manual de Funciones\n2. Verificar la Hoja de Vida en el SIGEP\n3. Aplicar los valores Institucionales\n4. Realizar el diligenciamiento de las listas de chequeo\n","Gerencia\nSubgerente Administrativo y Financiero",null,null,null,{"$f":"F18","v":2},{"$f":"IF(P18=\"Afecta la Probabilidad\",AM18-(AM18-AG18),\"No aplica\")","v":2},{"$f":"I18","v":4},{"$f":"IF(P18=\"Afecta el Impacto\",AO18-(AO18-AG18),\"No aplica\")","v":"No aplica"},{"$f":"IF(Matriz!P18=\"Afecta el Impacto\",CONCATENATE(AM18,AP18),CONCATENATE(AN18,AO18))","v":"24"},{"$f":"IF(P18=\"\",\"\",SUMIF(P18:P26,\"Afecta la Probabilidad\",AN18:AN26))","v":2},{"$f":"IF(P18=\"\",\"\",SUMIF(P18:P26,\"Afecta el Impacto\",AP18:AP26))","v":0},{"$f":"IF(AR18=\"\",\"\",IF(F18-AR18<=0,1,F18-AR18))","v":1},{"$f":"CONCATENATE(AT18,AV18)","v":"14"},{"$f":"IF(I18=\"\",\"\",IF(I18-AS18<0,1,I18-AS18))","v":4}]
[null,{"$f":"B18+1","v":2}]
[null,{"$f":"B19+1","v":3}]
[null,4]
[null,5]
[null,6]
[null,7]
[null,8]
[null,9]
["R3\nPLANEACIÓN INSTITUCIONAL\n",1,"Sanciones disciplinarias, penales y fiscales,  acciones judiciales en contra de Ila entidad; Violación de la confiabilidad de la información; Favorecimiento propio o de terceros.","Posibilidad de que se acceda, utilice o divulgue información confidencial de manera inapropiada ","Violacion de la Privacidad\nDesinformación.\nAfectación de la imagen institucional\n Riesgos de Seguridad de la Información",2,{"$f":"IF(F27=5,\"Mas de una vez al año\",IF(F27=4,\"Al menos una vez en el ultimo año\",IF(F27=3,\"Al menos una vez en los ultimos 2 años\",IF(F27=2,\"Al menos una vez en los ultimos 5 años\",\"No se ha presentado en los ultimos 5 años\"))))","v":"Al menos una vez en los ultimos 5 años"},{"$f":"CONCATENATE(F$27,I$27)","v":"24"},4,{"$f":"IF(I27=5,\"Catastrófico\",IF(I27=4,\"Mayor\",IF(I27=3,\"Moderado\",IF(I27=2,\"Menor\",IF(I27=1,\"Leve\",\"Digite Valor entre 1 y 5\")))))","v":"Mayor"},{"$f":"IF(J27=\"Digite Valor entre 1 y 5\",\"\",IF(COUNTIF(BU$236:BU$243,CONCATENATE(F27,I27)),BU$235,IF(COUNTIF(BV$236:BV$243,CONCATENATE(F27,I27)),BV$235,IF(COUNTIF(BW$236:BW$239,CONCATENATE(F27,I27)),BW$235,BX$235))))","v":"Zona de Riesgo Alta"},{"$f":"IF(K27=BU$235,\"E\",IF(K27=BV$235,\"A\",IF(K27=BW$235,\"M\",IF(K27=BX$235,\"B\",\"\"))))","v":"A"},"Control Preventivo","1. Aplicar la política de Seguridad de la Información\n2. Verificar el código de Integridad\n3. Clausula de confidencialidad  de la informacion  en materia contractual.","Continuo","Afecta la Probabilidad","Si",{"$f":"IF(Q27=\"Si\",15,0)","v":15},"Si",{"$f":"IF(S27=\"Si\",15,0)","v":15},"Oportuna",{"$f":"IF(U27=\"Oportuna\",15,0)","v":15},"Prevenir",{"$f":"IF(W27=\"Prevenir\",15,10)","v":15},"Confiable",{"$f":"IF(Y27=\"confiable\",15,0)","v":15},"Se investigan",{"$f":"IF(AA27=\"Se investigan\",15,0)","v":15},"Completa ",{"$f":"IF(AC27=\"Completa \",10,5)","v":10},{"$f":"R27+T27+V27+X27+Z27+AB27+AD27","v":100},{"$f":"IF(P27=\"\",\"\",IF(P27=\"Afecta la Probabilidad\",IF(AND(AE27>=0,AE27<=50),\"No disminuye la Probabilidad\",IF(AND(AE27>50,AE27<=75),\"Disminuye la Probabilidad en 1\",IF(AND(AE27>75,AE27<=100),\"Disminuye la Probabilidad en 2\",\"\"))),IF(AND(AE27>=0,AE27<=50),\"No disminuye el Impacto\",IF(AND(AE27>50,AE27<=75),\"Disminuye el Impacto en 1\",IF(AND(AE27>75,AE27<=100),\"Disminuye el Impacto en 2\",\"\")))))","v":"Disminuye la Probabilidad en 2"},{"$f":"IF(AE27<=50,0,IF(AND(AE27>50,AE27<=75),1,IF(AND(AE27>75,AE27<=100),2,\"\")))","v":2},"1. Cumplir con la acciones o estrategias definidas en la política de seguridad de la información\n2. Aplicar los valores institucionales.\n3. verificar que los contratos tengan la clausula de  confidencialidad de la informacion.","Jefe Planeación Institucional",null,null,null,{"$f":"F27","v":2},{"$f":"IF(P27=\"Afecta la Probabilidad\",AM27-(AM27-AG27),\"No aplica\")","v":2},{"$f":"I27","v":4},{"$f":"IF(P27=\"Afecta el Impacto\",AO27-(AO27-AG27),\"No aplica\")","v":"No aplica"},{"$f":"IF(Matriz!P27=\"Afecta el Impacto\",CONCATENATE(AM27,AP27),CONCATENATE(AN27,AO27))","v":"24"},{"$f":"IF(P27=\"\",\"\",SUMIF(P27:P35,\"Afecta la Probabilidad\",AN27:AN35))","v":2},{"$f":"IF(P27=\"\",\"\",SUMIF(P27:P35,\"Afecta el Impacto\",AP27:AP35))","v":0},{"$f":"IF(AR27=\"\",\"\",IF(F27-AR27<=0,1,F27-AR27))","v":1},{"$f":"CONCATENATE(AT27,AV27)","v":"14"},{"$f":"IF(I27=\"\",\"\",IF(I27-AS27<0,1,I27-AS27))","v":4}]
[null,{"$f":"B27+1","v":2}]
[null,{"$f":"B28+1","v":3}]
[null,4]
[null,5]
[null,6]
[null,7]
[null,8]
[null,9]
["R4\nGESTIÓN TÉCNICA\n",1,"Manipulación intencionada o por baja aplicación de los requerimientos para el apoyo económico a los deportistas de alto rendimiento\nFavorecimiento a terceros ","Posibilidad de alteración de resultados técnicos y biomédicos de los deportistas de alto rendimiento que atiende el Instituto","Impacto en la Salud de los Deportistas\nDesempeño Deportivo Comprometido\nPerdida de Confianza en el Instituto\nRepercusiones en la carrera de los deportistas",2,{"$f":"IF(F36=5,\"Mas de una vez al año\",IF(F36=4,\"Al menos una vez en el ultimo año\",IF(F36=3,\"Al menos una vez en los ultimos 2 años\",IF(F36=2,\"Al menos una vez en los ultimos 5 años\",\"No se ha presentado en los ultimos 5 años\"))))","v":"Al menos una vez en los ultimos 5 años"},{"$f":"CONCATENATE(F$36,I$36)","v":"24"},4,{"$f":"IF(I36=5,\"Catastrófico\",IF(I36=4,\"Mayor\",IF(I36=3,\"Moderado\",IF(I36=2,\"Menor\",IF(I36=1,\"Leve\",\"Digite Valor entre 1 y 5\")))))","v":"Mayor"},{"$f":"IF(J36=\"Digite Valor entre 1 y 5\",\"\",IF(COUNTIF(BU$236:BU$243,CONCATENATE(F36,I36)),BU$235,IF(COUNTIF(BV$236:BV$243,CONCATENATE(F36,I36)),BV$235,IF(COUNTIF(BW$236:BW$239,CONCATENATE(F36,I36)),BW$235,BX$235))))","v":"Zona de Riesgo Alta"},{"$f":"IF(K36=BU$235,\"E\",IF(K36=BV$235,\"A\",IF(K36=BW$235,\"M\",IF(K36=BX$235,\"B\",\"\"))))","v":"A"},"Control Preventivo","1. Validar Mensualmente los resultados tanto técnicos como biomédicos, de los deportistas orgullo caucano\n 2. Someter a discusión los resultados en comité técnico\n","Continuo","Afecta la Probabilidad","Si",{"$f":"IF(Q36=\"Si\",15,0)","v":15},"Si",{"$f":"IF(S36=\"Si\",15,0)","v":15},"Oportuna",{"$f":"IF(U36=\"Oportuna\",15,0)","v":15},"Prevenir",{"$f":"IF(W36=\"Prevenir\",15,10)","v":15},"Confiable",{"$f":"IF(Y36=\"confiable\",15,0)","v":15},"Se investigan",{"$f":"IF(AA36=\"Se investigan\",15,0)","v":15},"Completa ",{"$f":"IF(AC36=\"Completa \",10,5)","v":10},{"$f":"R36+T36+V36+X36+Z36+AB36+AD36","v":100},{"$f":"IF(P36=\"\",\"\",IF(P36=\"Afecta la Probabilidad\",IF(AND(AE36>=0,AE36<=50),\"No disminuye la Probabilidad\",IF(AND(AE36>50,AE36<=75),\"Disminuye la Probabilidad en 1\",IF(AND(AE36>75,AE36<=100),\"Disminuye la Probabilidad en 2\",\"\"))),IF(AND(AE36>=0,AE36<=50),\"No disminuye el Impacto\",IF(AND(AE36>50,AE36<=75),\"Disminuye el Impacto en 1\",IF(AND(AE36>75,AE36<=100),\"Disminuye el Impacto en 2\",\"\")))))","v":"Disminuye la Probabilidad en 2"},{"$f":"IF(AE36<=50,0,IF(AND(AE36>50,AE36<=75),1,IF(AND(AE36>75,AE36<=100),2,\"\")))","v":2},"1. Llevar a cabo reuniones de forma mensual del comité evaluador y el area biomedica.\n2. Elaborar actas del comité evaluador\n ","Subgerente Técnico",null,null,null,{"$f":"F36","v":2},{"$f":"IF(P36=\"Afecta la Probabilidad\",AM36-(AM36-AG36),\"No aplica\")","v":2},{"$f":"I36","v":4},{"$f":"IF(P36=\"Afecta el Impacto\",AO36-(AO36-AG36),\"No aplica\")","v":"No aplica"},{"$f":"IF(Matriz!P36=\"Afecta el Impacto\",CONCATENATE(AM36,AP36),CONCATENATE(AN36,AO36))","v":"24"},{"$f":"IF(P36=\"\",\"\",SUMIF(P36:P44,\"Afecta la Probabilidad\",AN36:AN44))","v":2},{"$f":"IF(P36=\"\",\"\",SUMIF(P36:P44,\"Afecta el Impacto\",AP36:AP44))","v":0},{"$f":"IF(AR36=\"\",\"\",IF(F36-AR36<=0,1,F36-AR36))","v":1},{"$f":"CONCATENATE(AT36,AV36)","v":"14"},{"$f":"IF(I36=\"\",\"\",IF(I36-AS36<0,1,I36-AS36))","v":4}]
[null,{"$f":"B36+1","v":2}]
[null,{"$f":"B37+1","v":3}]
[null,4]
[null,5]
[null,6]
[null,7]
[null,8]
[null,9]
["R5\nSISTEMAS DE INFORMACIÓN Y COMUNICACIÓN",1,"Perdida de la información","Posibilidad de que los sistemas de información sean susceptibles a manipulación o adulteración","Pérdida de Integridad de los Datos\nDaño a la Reputación\nInterrupciones de Operaciones\nRiesgos de Seguridad\nAfectación en la presentación de los servicios tecnológicos ",2,{"$f":"IF(F45=5,\"Mas de una vez al año\",IF(F45=4,\"Al menos una vez en el ultimo año\",IF(F45=3,\"Al menos una vez en los ultimos 2 años\",IF(F45=2,\"Al menos una vez en los ultimos 5 años\",\"No se ha presentado en los ultimos 5 años\"))))","v":"Al menos una vez en los ultimos 5 años"},{"$f":"CONCATENATE(F$45,I$45)","v":"24"},4,{"$f":"IF(I45=5,\"Catastrófico\",IF(I45=4,\"Mayor\",IF(I45=3,\"Moderado\",IF(I45=2,\"Menor\",IF(I45=1,\"Leve\",\"Digite Valor entre 1 y 5\")))))","v":"Mayor"},{"$f":"IF(J45=\"Digite Valor entre 1 y 5\",\"\",IF(COUNTIF(BU$236:BU$243,CONCATENATE(F45,I45)),BU$235,IF(COUNTIF(BV$236:BV$243,CONCATENATE(F45,I45)),BV$235,IF(COUNTIF(BW$236:BW$239,CONCATENATE(F45,I45)),BW$235,BX$235))))","v":"Zona de Riesgo Alta"},{"$f":"IF(K45=BU$235,\"E\",IF(K45=BV$235,\"A\",IF(K45=BW$235,\"M\",IF(K45=BX$235,\"B\",\"\"))))","v":"A"},"Control Preventivo","1. Aplicar políticas de Gobierno Digital\n2. Actualización de Licencias","Continuo","Afecta la Probabilidad","Si",{"$f":"IF(Q45=\"Si\",15,0)","v":15},"Si",{"$f":"IF(S45=\"Si\",15,0)","v":15},"Oportuna",{"$f":"IF(U45=\"Oportuna\",15,0)","v":15},"Prevenir",{"$f":"IF(W45=\"Prevenir\",15,10)","v":15},"Confiable",{"$f":"IF(Y45=\"confiable\",15,0)","v":15},"Se investigan",{"$f":"IF(AA45=\"Se investigan\",15,0)","v":15},"Completa ",{"$f":"IF(AC45=\"Completa \",10,5)","v":10},{"$f":"R45+T45+V45+X45+Z45+AB45+AD45","v":100},{"$f":"IF(P45=\"\",\"\",IF(P45=\"Afecta la Probabilidad\",IF(AND(AE45>=0,AE45<=50),\"No disminuye la Probabilidad\",IF(AND(AE45>50,AE45<=75),\"Disminuye la Probabilidad en 1\",IF(AND(AE45>75,AE45<=100),\"Disminuye la Probabilidad en 2\",\"\"))),IF(AND(AE45>=0,AE45<=50),\"No disminuye el Impacto\",IF(AND(AE45>50,AE45<=75),\"Disminuye el Impacto en 1\",IF(AND(AE45>75,AE45<=100),\"Disminuye el Impacto en 2\",\"\")))))","v":"Disminuye la Probabilidad en 2"},{"$f":"IF(AE45<=50,0,IF(AND(AE45>50,AE45<=75),1,IF(AND(AE45>75,AE45<=100),2,\"\")))","v":2},"1. Realizar la verificación de la información de acuerdo a la ley ITA\n2 Implementar política de seguridad digital\n3. Instalación y actualización de Antivirus licenciado.\n","Jefe Planeación Institucional\nContratista de Apoyo Sistemas de Información",null,null,null,{"$f":"F45","v":2},{"$f":"IF(P45=\"Afecta la Probabilidad\",AM45-(AM45-AG45),\"No aplica\")","v":2},{"$f":"I45","v":4},{"$f":"IF(P45=\"Afecta el Impacto\",AO45-(AO45-AG45),\"No aplica\")","v":"No aplica"},{"$f":"IF(Matriz!P45=\"Afecta el Impacto\",CONCATENATE(AM45,AP45),CONCATENATE(AN45,AO45))","v":"24"},{"$f":"IF(P45=\"\",\"\",SUMIF(P45:P53,\"Afecta la Probabilidad\",AN45:AN53))","v":2},{"$f":"IF(P45=\"\",\"\",SUMIF(P45:P53,\"Afecta el Impacto\",AP45:AP53))","v":0},{"$f":"IF(AR45=\"\",\"\",IF(F45-AR45<=0,1,F45-AR45))","v":1},{"$f":"CONCATENATE(AT45,AV45)","v":"14"},{"$f":"IF(I45=\"\",\"\",IF(I45-AS45<0,1,I45-AS45))","v":4}]
[null,{"$f":"B45+1","v":2}]
[null,3]
[null,4]
[null,5]
[null,6]
[null,7]
[null,8]
[null,9]
["R6\nGESTIÓN ADMINISTRATIVA Y FINANCIERA \nCONTABILIDAD",1,"Generación de información contable y estados financieros poco confiables.","Posibilidad de la no  veracidad de la informacion contable y financiera","Errores en la presentación de Informes Financieros\nDificultades en la Planificación y Presupuesto",2,{"$f":"IF(F54=5,\"Mas de una vez al año\",IF(F54=4,\"Al menos una vez en el ultimo año\",IF(F54=3,\"Al menos una vez en los ultimos 2 años\",IF(F54=2,\"Al menos una vez en los ultimos 5 años\",\"No se ha presentado en los ultimos 5 años\"))))","v":"Al menos una vez en los ultimos 5 años"},{"$f":"CONCATENATE(F$54,I$54)","v":"25"},5,{"$f":"IF(I54=5,\"Catastrófico\",IF(I54=4,\"Mayor\",IF(I54=3,\"Moderado\",IF(I54=2,\"Menor\",IF(I54=1,\"Leve\",\"Digite Valor entre 1 y 5\")))))","v":"Catastrófico"},{"$f":"IF(J54=\"Digite Valor entre 1 y 5\",\"\",IF(COUNTIF(BU$236:BU$243,CONCATENATE(F54,I54)),BU$235,IF(COUNTIF(BV$236:BV$243,CONCATENATE(F54,I54)),BV$235,IF(COUNTIF(BW$236:BW$239,CONCATENATE(F54,I54)),BW$235,BX$235))))","v":"Zona de Riesgo Extrema"},{"$f":"IF(K54=BU$235,\"E\",IF(K54=BV$235,\"A\",IF(K54=BW$235,\"M\",IF(K54=BX$235,\"B\",\"\"))))","v":"E"},"Control Preventivo","1. Realizar conciliaciones periódicas de cuentas\n2. Procedimientos contables Claro\n3.cumplimiento  del còdigo de integridad","Continuo","Afecta la Probabilidad","Si",{"$f":"IF(Q54=\"Si\",15,0)","v":15},"Si",{"$f":"IF(S54=\"Si\",15,0)","v":15},"Oportuna",{"$f":"IF(U54=\"Oportuna\",15,0)","v":15},"Prevenir",{"$f":"IF(W54=\"Prevenir\",15,10)","v":15},"Confiable",{"$f":"IF(Y54=\"confiable\",15,0)","v":15},"Se investigan",{"$f":"IF(AA54=\"Se investigan\",15,0)","v":15},"Completa ",{"$f":"IF(AC54=\"Completa \",10,5)","v":10},{"$f":"R54+T54+V54+X54+Z54+AB54+AD54","v":100},{"$f":"IF(P54=\"\",\"\",IF(P54=\"Afecta la Probabilidad\",IF(AND(AE54>=0,AE54<=50),\"No disminuye la Probabilidad\",IF(AND(AE54>50,AE54<=75),\"Disminuye la Probabilidad en 1\",IF(AND(AE54>75,AE54<=100),\"Disminuye la Probabilidad en 2\",\"\"))),IF(AND(AE54>=0,AE54<=50),\"No disminuye el Impacto\",IF(AND(AE54>50,AE54<=75),\"Disminuye el Impacto en 1\",IF(AND(AE54>75,AE54<=100),\"Disminuye el Impacto en 2\",\"\")))))","v":"Disminuye la Probabilidad en 2"},{"$f":"IF(AE54<=50,0,IF(AND(AE54>50,AE54<=75),1,IF(AND(AE54>75,AE54<=100),2,\"\")))","v":2},"1. Aplicación del procedimiento de elaboración de estados financieros\n2.generar, transmitir y difundir la informacion financiera del instituto en sus diferentes aplicativos(chip-contraloria General de laNacion, Sia Contraloria)\n3. Aplicar los valores Institucionales\n","Subgerente Administrativo, Financiero y del Talento Humano\nContador",null,null,null,{"$f":"F54","v":2},{"$f":"IF(P54=\"Afecta la Probabilidad\",AM54-(AM54-AG54),\"No aplica\")","v":2},{"$f":"I54","v":5},{"$f":"IF(P54=\"Afecta el Impacto\",AO54-(AO54-AG54),\"No aplica\")","v":"No aplica"},{"$f":"IF(Matriz!P54=\"Afecta el Impacto\",CONCATENATE(AM54,AP54),CONCATENATE(AN54,AO54))","v":"25"},{"$f":"IF(P54=\"\",\"\",SUMIF(P54:P62,\"Afecta la Probabilidad\",AN54:AN62))","v":2},{"$f":"IF(P54=\"\",\"\",SUMIF(P54:P62,\"Afecta el Impacto\",AP54:AP62))","v":0},{"$f":"IF(AR54=\"\",\"\",IF(F54-AR54<=0,1,F54-AR54))","v":1},{"$f":"CONCATENATE(AT54,AV54)","v":"15"},{"$f":"IF(I54=\"\",\"\",IF(I54-AS54<0,1,I54-AS54))","v":5},null,null,null,null,null,null,null,null,null,null,null,null,null,null,null,null,null,null,null,null,null,null,null,null,{"$f":"COUNTIF(BU10:BU17,CONCATENATE(F9,I9))","v":0},{"$f":"COUNTIF(BV10:BV17,CONCATENATE(F9,I9))","v":0},{"$f":"COUNTIF(BW10:BW17,CONCATENATE(G9,J9))","v":0},{"$f":"COUNTIF(BX10:BX17,CONCATENATE(H9,K9))","v":0}]
[null,2]
[null,3]
[null,4]
[null,5]
[null,6]
[null,7]
[null,8]
[null,9]
["R7\nGESTIÓN ADMINISTRATIVA Y FINANCIERA \nALMACÈN",1,"Concentración de poder; abuso o manipulación de la información.\nSupervisión Inadecuada en la gestión de inventarios.","Posibilidad de manipulación de inventarios para beneficio personal o de terceros.\n","Investigaciones disciplinarias, administrativas, fiscales y penales.         \nPerdida de Integridad y confianza",2,{"$f":"IF(F63=5,\"Mas de una vez al año\",IF(F63=4,\"Al menos una vez en el ultimo año\",IF(F63=3,\"Al menos una vez en los ultimos 2 años\",IF(F63=2,\"Al menos una vez en los ultimos 5 años\",\"No se ha presentado en los ultimos 5 años\"))))","v":"Al menos una vez en los ultimos 5 años"},{"$f":"CONCATENATE(F$63,I$63)","v":"25"},5,{"$f":"IF(I63=5,\"Catastrófico\",IF(I63=4,\"Mayor\",IF(I63=3,\"Moderado\",IF(I63=2,\"Menor\",IF(I63=1,\"Leve\",\"Digite Valor entre 1 y 5\")))))","v":"Catastrófico"},{"$f":"IF(J63=\"Digite Valor entre 1 y 5\",\"\",IF(COUNTIF(BU$236:BU$243,CONCATENATE(F63,I63)),BU$235,IF(COUNTIF(BV$236:BV$243,CONCATENATE(F63,I63)),BV$235,IF(COUNTIF(BW$236:BW$239,CONCATENATE(F63,I63)),BW$235,BX$235))))","v":"Zona de Riesgo Extrema"},{"$f":"IF(K63=BU$235,\"E\",IF(K63=BV$235,\"A\",IF(K63=BW$235,\"M\",IF(K63=BX$235,\"B\",\"\"))))","v":"E"},"Control Preventivo","1. Tener actualizado el módulo de inventarios en el sistema Xpert\n2.  Realizar Inventarios Físicos\n","Continuo","Afecta la Probabilidad","Si",{"$f":"IF(Q63=\"Si\",15,0)","v":15},"Si",{"$f":"IF(S63=\"Si\",15,0)","v":15},"Oportuna",{"$f":"IF(U63=\"Oportuna\",15,0)","v":15},"Prevenir",{"$f":"IF(W63=\"Prevenir\",15,10)","v":15},"Confiable",{"$f":"IF(Y63=\"confiable\",15,0)","v":15},"Se investigan",{"$f":"IF(AA63=\"Se investigan\",15,0)","v":15},"Completa ",{"$f":"IF(AC63=\"Completa \",10,5)","v":10},{"$f":"R63+T63+V63+X63+Z63+AB63+AD63","v":100},{"$f":"IF(P63=\"\",\"\",IF(P63=\"Afecta la Probabilidad\",IF(AND(AE63>=0,AE63<=50),\"No disminuye la Probabilidad\",IF(AND(AE63>50,AE63<=75),\"Disminuye la Probabilidad en 1\",IF(AND(AE63>75,AE63<=100),\"Disminuye la Probabilidad en 2\",\"\"))),IF(AND(AE63>=0,AE63<=50),\"No disminuye el Impacto\",IF(AND(AE63>50,AE63<=75),\"Disminuye el Impacto en 1\",IF(AND(AE63>75,AE63<=100),\"Disminuye el Impacto en 2\",\"\")))))","v":"Disminuye la Probabilidad en 2"},{"$f":"IF(AE63<=50,0,IF(AND(AE63>50,AE63<=75),1,IF(AND(AE63>75,AE63<=100),2,\"\")))","v":2},"1. Actualización del módulo de inventarios cada vez que sea necesario\n2.  Realizar (Selectivas entre los libros y el inventario físico) 3 dar cumplimiento al  codigo de etica del  funcionario.\n","Subgerente Administrativo, Financiero y del Talento Humano\nResponsable de Almacén",null,null,null,{"$f":"F63","v":2},{"$f":"IF(P63=\"Afecta la Probabilidad\",AM63-(AM63-AG63),\"No aplica\")","v":2},{"$f":"I63","v":5},{"$f":"IF(P63=\"Afecta el Impacto\",AO63-(AO63-AG63),\"No aplica\")","v":"No aplica"},{"$f":"IF(Matriz!P63=\"Afecta el Impacto\",CONCATENATE(AM63,AP63),CONCATENATE(AN63,AO63))","v":"25"},{"$f":"IF(P63=\"\",\"\",SUMIF(P63:P71,\"Afecta la Probabilidad\",AN63:AN71))","v":2},{"$f":"IF(P63=\"\",\"\",SUMIF(P63:P71,\"Afecta el Impacto\",AP63:AP71))","v":0},{"$f":"IF(AR63=\"\",\"\",IF(F63-AR63<=0,1,F63-AR63))","v":1},{"$f":"CONCATENATE(AT63,AV63)","v":"15"},{"$f":"IF(I63=\"\",\"\",IF(I63-AS63<0,1,I63-AS63))","v":5}]
[null,2]
[null,3]
[null,4]
[null,5]
[null,6]
[null,7]
[null,8]
[null,9]
["R8\nGESTIÓN ADMINISTRATIVA Y FINANCIERA\n GESTIÓN  DOCUMENTAL",1,"Aceptar o recibir dádivas por parte del funcionario encargado de la custodia de los documentos","Posibilidad de destruir documentación importante de la entidad, para beneficios de particulares.","Investigaciones disciplinarias, administrativas, fiscales y penales.         \nPerdida de Información\nPerdida de Historia Institucional\nConfusión y Desorganización",2,{"$f":"IF(F72=5,\"Mas de una vez al año\",IF(F72=4,\"Al menos una vez en el ultimo año\",IF(F72=3,\"Al menos una vez en los ultimos 2 años\",IF(F72=2,\"Al menos una vez en los ultimos 5 años\",\"No se ha presentado en los ultimos 5 años\"))))","v":"Al menos una vez en los ultimos 5 años"},{"$f":"CONCATENATE(F$72,I$72)","v":"25"},5,{"$f":"IF(I72=5,\"Catastrófico\",IF(I72=4,\"Mayor\",IF(I72=3,\"Moderado\",IF(I72=2,\"Menor\",IF(I72=1,\"Leve\",\"Digite Valor entre 1 y 5\")))))","v":"Catastrófico"},{"$f":"IF(J72=\"Digite Valor entre 1 y 5\",\"\",IF(COUNTIF(BU$236:BU$243,CONCATENATE(F72,I72)),BU$235,IF(COUNTIF(BV$236:BV$243,CONCATENATE(F72,I72)),BV$235,IF(COUNTIF(BW$236:BW$239,CONCATENATE(F72,I72)),BW$235,BX$235))))","v":"Zona de Riesgo Extrema"},{"$f":"IF(K72=BU$235,\"E\",IF(K72=BV$235,\"A\",IF(K72=BW$235,\"M\",IF(K72=BX$235,\"B\",\"\"))))","v":"E"},"Control Preventivo","1. Aplicar el procedimiento de organización de documentos\n2. Aplicar las TRD\n3. Aplicar el procedimiento de acceso consulta y préstamo de documentos","Continuo","Afecta la Probabilidad","Si",{"$f":"IF(Q72=\"Si\",15,0)","v":15},"Si",{"$f":"IF(S72=\"Si\",15,0)","v":15},"Oportuna",{"$f":"IF(U72=\"Oportuna\",15,0)","v":15},"Prevenir",{"$f":"IF(W72=\"Prevenir\",15,10)","v":15},"Confiable",{"$f":"IF(Y72=\"confiable\",15,0)","v":15},"Se investigan",{"$f":"IF(AA72=\"Se investigan\",15,0)","v":15},"Completa ",{"$f":"IF(AC72=\"Completa \",10,5)","v":10},{"$f":"R72+T72+V72+X72+Z72+AB72+AD72","v":100},{"$f":"IF(P72=\"\",\"\",IF(P72=\"Afecta la Probabilidad\",IF(AND(AE72>=0,AE72<=50),\"No disminuye la Probabilidad\",IF(AND(AE72>50,AE72<=75),\"Disminuye la Probabilidad en 1\",IF(AND(AE72>75,AE72<=100),\"Disminuye la Probabilidad en 2\",\"\"))),IF(AND(AE72>=0,AE72<=50),\"No disminuye el Impacto\",IF(AND(AE72>50,AE72<=75),\"Disminuye el Impacto en 1\",IF(AND(AE72>75,AE72<=100),\"Disminuye el Impacto en 2\",\"\")))))","v":"Disminuye la Probabilidad en 2"},{"$f":"IF(AE72<=50,0,IF(AND(AE72>50,AE72<=75),1,IF(AND(AE72>75,AE72<=100),2,\"\")))","v":2},"1. Capacitar a los líderes de proceso y su personal de apoyo\n2. Digitalizar Documentos\n3. Realizar Backups de la Información\n4. Aplicación del Sistema Xpert\n","Subgerente Administrativo, Financiero y del Talento Personal de Apoyo de  Gestión Documental",null,null,null,{"$f":"F72","v":2},{"$f":"IF(P72=\"Afecta la Probabilidad\",AM72-(AM72-AG72),\"No aplica\")","v":2},{"$f":"I72","v":5},{"$f":"IF(P72=\"Afecta el Impacto\",AO72-(AO72-AG72),\"No aplica\")","v":"No aplica"},{"$f":"IF(Matriz!P72=\"Afecta el Impacto\",CONCATENATE(AM72,AP72),CONCATENATE(AN72,AO72))","v":"25"},{"$f":"IF(P72=\"\",\"\",SUMIF(P72:P80,\"Afecta la Probabilidad\",AN72:AN80))","v":2},{"$f":"IF(P72=\"\",\"\",SUMIF(P72:P80,\"Afecta el Impacto\",AP72:AP80))","v":0},{"$f":"IF(AR72=\"\",\"\",IF(F72-AR72<=0,1,F72-AR72))","v":1},{"$f":"CONCATENATE(AT72,AV72)","v":"15"},{"$f":"IF(I72=\"\",\"\",IF(I72-AS72<0,1,I72-AS72))","v":5}]
[null,2]
[null,3]
[null,4]
[null,5]
[null,6]
[null,7]
[null,8]
[null,9]
["R9\nGESTIÓN ADMINISTRATIVA Y FINANCIERA\n TALENTO HUMANO",1,"Manipulación de los servidores y correos electrónicos por terceros","Posibilidad de contratación intencional de personal de planta sin cumplir con los requisitos establecidos","Deterioro de la Cultura Organizacional\nDificultades en la Evaluación del Desempeño\nDificultades en el cumplimiento de metas\nProcesos disciplinarios",2,{"$f":"IF(F81=5,\"Mas de una vez al año\",IF(F81=4,\"Al menos una vez en el ultimo año\",IF(F81=3,\"Al menos una vez en los ultimos 2 años\",IF(F81=2,\"Al menos una vez en los ultimos 5 años\",\"No se ha presentado en los ultimos 5 años\"))))","v":"Al menos una vez en los ultimos 5 años"},{"$f":"CONCATENATE(F$81,I$81)","v":"24"},4,{"$f":"IF(I81=5,\"Catastrófico\",IF(I81=4,\"Mayor\",IF(I81=3,\"Moderado\",IF(I81=2,\"Menor\",IF(I81=1,\"Leve\",\"Digite Valor entre 1 y 5\")))))","v":"Mayor"},{"$f":"IF(J81=\"Digite Valor entre 1 y 5\",\"\",IF(COUNTIF(BU$236:BU$243,CONCATENATE(F81,I81)),BU$235,IF(COUNTIF(BV$236:BV$243,CONCATENATE(F81,I81)),BV$235,IF(COUNTIF(BW$236:BW$239,CONCATENATE(F81,I81)),BW$235,BX$235))))","v":"Zona de Riesgo Alta"},{"$f":"IF(K81=BU$235,\"E\",IF(K81=BV$235,\"A\",IF(K81=BW$235,\"M\",IF(K81=BX$235,\"B\",\"\"))))","v":"A"},"Control Preventivo","1. Verificar el  cumplimiento del Manual de Funciones\n2. Verificar la documentación de la plataforma de hojas de vida SIGEP\n","Continuo","Afecta la Probabilidad","Si",{"$f":"IF(Q81=\"Si\",15,0)","v":15},"Si",{"$f":"IF(S81=\"Si\",15,0)","v":15},"Oportuna",{"$f":"IF(U81=\"Oportuna\",15,0)","v":15},"Prevenir",{"$f":"IF(W81=\"Prevenir\",15,10)","v":15},"Confiable",{"$f":"IF(Y81=\"confiable\",15,0)","v":15},"Se investigan",{"$f":"IF(AA81=\"Se investigan\",15,0)","v":15},"Completa ",{"$f":"IF(AC81=\"Completa \",10,5)","v":10},{"$f":"R81+T81+V81+X81+Z81+AB81+AD81","v":100},{"$f":"IF(P81=\"\",\"\",IF(P81=\"Afecta la Probabilidad\",IF(AND(AE81>=0,AE81<=50),\"No disminuye la Probabilidad\",IF(AND(AE81>50,AE81<=75),\"Disminuye la Probabilidad en 1\",IF(AND(AE81>75,AE81<=100),\"Disminuye la Probabilidad en 2\",\"\"))),IF(AND(AE81>=0,AE81<=50),\"No disminuye el Impacto\",IF(AND(AE81>50,AE81<=75),\"Disminuye el Impacto en 1\",IF(AND(AE81>75,AE81<=100),\"Disminuye el Impacto en 2\",\"\")))))","v":"Disminuye la Probabilidad en 2"},{"$f":"IF(AE81<=50,0,IF(AND(AE81>50,AE81<=75),1,IF(AND(AE81>75,AE81<=100),2,\"\")))","v":2},"1. Aplicar los requisitos establecidos en el Manual de Funciones\n2. Validar la documentación de la Hoja de Vida en el SIGEP\n3. Realizar el diligenciamiento de las listas de chequeo","Subgerente Administrativo, Financiero y del Talento Personal de Apoyo de  Talento Humano",null,null,null,{"$f":"F81","v":2},{"$f":"IF(P81=\"Afecta la Probabilidad\",AM81-(AM81-AG81),\"No aplica\")","v":2},{"$f":"I81","v":4},{"$f":"IF(P81=\"Afecta el Impacto\",AO81-(AO81-AG81),\"No aplica\")","v":"No aplica"},{"$f":"IF(Matriz!P81=\"Afecta el Impacto\",CONCATENATE(AM81,AP81),CONCATENATE(AN81,AO81))","v":"24"},{"$f":"IF(P81=\"\",\"\",SUMIF(P81:P89,\"Afecta la Probabilidad\",AN81:AN89))","v":2},{"$f":"IF(P81=\"\",\"\",SUMIF(P81:P89,\"Afecta el Impacto\",AP81:AP89))","v":0},{"$f":"IF(AR81=\"\",\"\",IF(F81-AR81<=0,1,F81-AR81))","v":1},{"$f":"CONCATENATE(AT81,AV81)","v":"14"},{"$f":"IF(I81=\"\",\"\",IF(I81-AS81<0,1,I81-AS81))","v":4}]
[null,2]
[null,3]
[null,4]
[null,5]
[null,6]
[null,7]
[null,8]
[null,9]
["R10\nCONTROL INTERNO",1,"\nFalta de ética profesional del auditor interno \nPresentación de resultados parcializados y amañados; favorecimiento o perjuicio a los auditados; vencimiento de términos legales por omisiones.","Posibilidad de incurrir en una omisión intencional de posibles actos de corrupción o irregularidades administrativas","Procesos Disciplinarios \nPérdida de credibilidad de la oficina de control interno \nToma de decisiones erradas",2,{"$f":"IF(F90=5,\"Mas de una vez al año\",IF(F90=4,\"Al menos una vez en el ultimo año\",IF(F90=3,\"Al menos una vez en los ultimos 2 años\",IF(F90=2,\"Al menos una vez en los ultimos 5 años\",\"No se ha presentado en los ultimos 5 años\"))))","v":"Al menos una vez en los ultimos 5 años"},{"$f":"CONCATENATE(F$90,I$90)","v":"25"},5,{"$f":"IF(I90=5,\"Catastrófico\",IF(I90=4,\"Mayor\",IF(I90=3,\"Moderado\",IF(I90=2,\"Menor\",IF(I90=1,\"Leve\",\"Digite Valor entre 1 y 5\")))))","v":"Catastrófico"},{"$f":"IF(J90=\"Digite Valor entre 1 y 5\",\"\",IF(COUNTIF(BU$236:BU$243,CONCATENATE(F90,I90)),BU$235,IF(COUNTIF(BV$236:BV$243,CONCATENATE(F90,I90)),BV$235,IF(COUNTIF(BW$236:BW$239,CONCATENATE(F90,I90)),BW$235,BX$235))))","v":"Zona de Riesgo Extrema"},{"$f":"IF(K90=BU$235,\"E\",IF(K90=BV$235,\"A\",IF(K90=BW$235,\"M\",IF(K90=BX$235,\"B\",\"\"))))","v":"E"},"Control Preventivo","1. Aplicación de los debidos procesos en las diferentes auditorias  2 dar aplicacion  al  codigo de etica institucional           ","Continuo","Afecta la Probabilidad","Si",{"$f":"IF(Q90=\"Si\",15,0)","v":15},"Si",{"$f":"IF(S90=\"Si\",15,0)","v":15},"Oportuna",{"$f":"IF(U90=\"Oportuna\",15,0)","v":15},"Prevenir",{"$f":"IF(W90=\"Prevenir\",15,10)","v":15},"Confiable",{"$f":"IF(Y90=\"confiable\",15,0)","v":15},"Se investigan",{"$f":"IF(AA90=\"Se investigan\",15,0)","v":15},"Completa ",{"$f":"IF(AC90=\"Completa \",10,5)","v":10},{"$f":"R90+T90+V90+X90+Z90+AB90+AD90","v":100},{"$f":"IF(P90=\"\",\"\",IF(P90=\"Afecta la Probabilidad\",IF(AND(AE90>=0,AE90<=50),\"No disminuye la Probabilidad\",IF(AND(AE90>50,AE90<=75),\"Disminuye la Probabilidad en 1\",IF(AND(AE90>75,AE90<=100),\"Disminuye la Probabilidad en 2\",\"\"))),IF(AND(AE90>=0,AE90<=50),\"No disminuye el Impacto\",IF(AND(AE90>50,AE90<=75),\"Disminuye el Impacto en 1\",IF(AND(AE90>75,AE90<=100),\"Disminuye el Impacto en 2\",\"\")))))","v":"Disminuye la Probabilidad en 2"},{"$f":"IF(AE90<=50,0,IF(AND(AE90>50,AE90<=75),1,IF(AND(AE90>75,AE90<=100),2,\"\")))","v":2},"1.Realizar al detalle de los informes de Auditoría\n2. Realizar socializaciones de las auditorías a los auditados\n","Jefe Oficina de Control Interno",null,null,null,{"$f":"F90","v":2},{"$f":"IF(P90=\"Afecta la Probabilidad\",AM90-(AM90-AG90),\"No aplica\")","v":2},{"$f":"I90","v":5},{"$f":"IF(P90=\"Afecta el Impacto\",AO90-(AO90-AG90),\"No aplica\")","v":"No aplica"},{"$f":"IF(Matriz!P90=\"Afecta el Impacto\",CONCATENATE(AM90,AP90),CONCATENATE(AN90,AO90))","v":"25"},{"$f":"IF(P90=\"\",\"\",SUMIF(P90:P98,\"Afecta la Probabilidad\",AN90:AN98))","v":2},{"$f":"IF(P90=\"\",\"\",SUMIF(P90:P98,\"Afecta el Impacto\",AP90:AP98))","v":0},{"$f":"IF(AR90=\"\",\"\",IF(F90-AR90<=0,1,F90-AR90))","v":1},{"$f":"CONCATENATE(AT90,AV90)","v":"15"},{"$f":"IF(I90=\"\",\"\",IF(I90-AS90<0,1,I90-AS90))","v":5}]
[null,{"$f":"B90+1","v":2}]
[null,3]
[null,4]
[null,5]
[null,6]
[null,7]
[null,8]
[null,9]
["R11\nGESTIÓN ADMINISTRATIVA Y FINANCIERA\n TESORERÍA",1,"Falta de ética profesional \nIncumplimiento a los valores institucionales\nIntereses Particulares","Posibilidad de solicitar o aceptar dádivas para acelerar procesos de pago","Procesos Disciplinios y penales\nViolación del código de Integridad\nRetrasos en pagos legítimos\n",2,{"$f":"IF(F99=5,\"Mas de una vez al año\",IF(F99=4,\"Al menos una vez en el ultimo año\",IF(F99=3,\"Al menos una vez en los ultimos 2 años\",IF(F99=2,\"Al menos una vez en los ultimos 5 años\",\"No se ha presentado en los ultimos 5 años\"))))","v":"Al menos una vez en los ultimos 5 años"},{"$f":"CONCATENATE(F$99,I$99)","v":"23"},3,{"$f":"IF(I99=5,\"Catastrófico\",IF(I99=4,\"Mayor\",IF(I99=3,\"Moderado\",IF(I99=2,\"Menor\",IF(I99=1,\"Leve\",\"Digite Valor entre 1 y 5\")))))","v":"Moderado"},{"$f":"IF(J99=\"Digite Valor entre 1 y 5\",\"\",IF(COUNTIF(BU$236:BU$243,CONCATENATE(F99,I99)),BU$235,IF(COUNTIF(BV$236:BV$243,CONCATENATE(F99,I99)),BV$235,IF(COUNTIF(BW$236:BW$239,CONCATENATE(F99,I99)),BW$235,BX$235))))","v":"Zona de Riesgo Moderada"},{"$f":"IF(K99=BU$235,\"E\",IF(K99=BV$235,\"A\",IF(K99=BW$235,\"M\",IF(K99=BX$235,\"B\",\"\"))))","v":"M"},"Control Preventivo","1.Verificar los registros de órdenes de pago.\n2. Verificar el código de Integridad\n","Continuo","Afecta la Probabilidad","Si",{"$f":"IF(Q99=\"Si\",15,0)","v":15},"Si",{"$f":"IF(S99=\"Si\",15,0)","v":15},"Oportuna",{"$f":"IF(U99=\"Oportuna\",15,0)","v":15},"Prevenir",{"$f":"IF(W99=\"Prevenir\",15,10)","v":15},"Confiable",{"$f":"IF(Y99=\"confiable\",15,0)","v":15},"Se investigan",{"$f":"IF(AA99=\"Se investigan\",15,0)","v":15},"Completa ",{"$f":"IF(AC99=\"Completa \",10,5)","v":10},{"$f":"R99+T99+V99+X99+Z99+AB99+AD99","v":100},{"$f":"IF(P99=\"\",\"\",IF(P99=\"Afecta la Probabilidad\",IF(AND(AE99>=0,AE99<=50),\"No disminuye la Probabilidad\",IF(AND(AE99>50,AE99<=75),\"Disminuye la Probabilidad en 1\",IF(AND(AE99>75,AE99<=100),\"Disminuye la Probabilidad en 2\",\"\"))),IF(AND(AE99>=0,AE99<=50),\"No disminuye el Impacto\",IF(AND(AE99>50,AE99<=75),\"Disminuye el Impacto en 1\",IF(AND(AE99>75,AE99<=100),\"Disminuye el Impacto en 2\",\"\")))))","v":"Disminuye la Probabilidad en 2"},{"$f":"IF(AE99<=50,0,IF(AND(AE99>50,AE99<=75),1,IF(AND(AE99>75,AE99<=100),2,\"\")))","v":2},"1. respectar el derecho de turno\n2. Aplicación de los valores Institucionales  3. establecer unas fechas de pago                     ","Subgerente Administrativo, Financiero y del Talento Tesorero General",null,null,null,{"$f":"F99","v":2},{"$f":"IF(P99=\"Afecta la Probabilidad\",AM99-(AM99-AG99),\"No aplica\")","v":2},{"$f":"I99","v":3},{"$f":"IF(P99=\"Afecta el Impacto\",AO99-(AO99-AG99),\"No aplica\")","v":"No aplica"},{"$f":"IF(Matriz!P99=\"Afecta el Impacto\",CONCATENATE(AM99,AP99),CONCATENATE(AN99,AO99))","v":"23"},{"$f":"IF(P99=\"\",\"\",SUMIF(P99:P107,\"Afecta la Probabilidad\",AN99:AN107))","v":2},{"$f":"IF(P99=\"\",\"\",SUMIF(P99:P107,\"Afecta el Impacto\",AP99:AP107))","v":0},{"$f":"IF(AR99=\"\",\"\",IF(F99-AR99<=0,1,F99-AR99))","v":1},{"$f":"CONCATENATE(AT99,AV99)","v":"13"},{"$f":"IF(I99=\"\",\"\",IF(I99-AS99<0,1,I99-AS99))","v":3}]
[null,2]
[null,3]
[null,4]
[null,5]
[null,6]
[null,7]
[null,8]
[null,9]
["R12\nGESTIÓN JURÍDICA",1,"Falta de personal especializado que realice los estudios previos.\n\nDesconocimiento de la normatividad vigente sobre Contratación Estatal\n\nDesconocimiento o inaplicabilidad al manual de contratación de la Entidad\n\nViolación a la normatividad sobre el régimen de inhabilidades e incompatibilidades, régimen penal, disciplinario, fiscal, Administrativo sancionatorio","Posibilidad ocurrencia de irregularidades en la contratación para favorecer a terceros durante las etapas del proceso contractual","Consecuencias legales y regulatorias\nProcesos disciplinarios y penales\nPerdida reputacional",2,{"$f":"IF(F108=5,\"Mas de una vez al año\",IF(F108=4,\"Al menos una vez en el ultimo año\",IF(F108=3,\"Al menos una vez en los ultimos 2 años\",IF(F108=2,\"Al menos una vez en los ultimos 5 años\",\"No se ha presentado en los ultimos 5 años\"))))","v":"Al menos una vez en los ultimos 5 años"},{"$f":"CONCATENATE(F$108,I$108)","v":"24"},4,{"$f":"IF(I108=5,\"Catastrófico\",IF(I108=4,\"Mayor\",IF(I108=3,\"Moderado\",IF(I108=2,\"Menor\",IF(I108=1,\"Leve\",\"Digite Valor entre 1 y 5\")))))","v":"Mayor"},{"$f":"IF(J108=\"Digite Valor entre 1 y 5\",\"\",IF(COUNTIF(BU$236:BU$243,CONCATENATE(F108,I108)),BU$235,IF(COUNTIF(BV$236:BV$243,CONCATENATE(F108,I108)),BV$235,IF(COUNTIF(BW$236:BW$239,CONCATENATE(F108,I108)),BW$235,BX$235))))","v":"Zona de Riesgo Alta"},{"$f":"IF(K108=BU$235,\"E\",IF(K108=BV$235,\"A\",IF(K108=BW$235,\"M\",IF(K108=BX$235,\"B\",\"\"))))","v":"A"},"Control Preventivo","1. Aplicar la normatividad vigente en los procesos de contratación\n2. Mantener Actualizado el Manual de contratación.\n3 senimiento a la ley 80 del 93","Continuo","Afecta la Probabilidad","Si",{"$f":"IF(Q108=\"Si\",15,0)","v":15},"Si",{"$f":"IF(S108=\"Si\",15,0)","v":15},"Oportuna",{"$f":"IF(U108=\"Oportuna\",15,0)","v":15},"Prevenir",{"$f":"IF(W108=\"Prevenir\",15,10)","v":15},"Confiable",{"$f":"IF(Y108=\"confiable\",15,0)","v":15},"Se investigan",{"$f":"IF(AA108=\"Se investigan\",15,0)","v":15},"Completa ",{"$f":"IF(AC108=\"Completa \",10,5)","v":10},{"$f":"R108+T108+V108+X108+Z108+AB108+AD108","v":100},{"$f":"IF(P108=\"\",\"\",IF(P108=\"Afecta la Probabilidad\",IF(AND(AE108>=0,AE108<=50),\"No disminuye la Probabilidad\",IF(AND(AE108>50,AE108<=75),\"Disminuye la Probabilidad en 1\",IF(AND(AE108>75,AE108<=100),\"Disminuye la Probabilidad en 2\",\"\"))),IF(AND(AE108>=0,AE108<=50),\"No disminuye el Impacto\",IF(AND(AE108>50,AE108<=75),\"Disminuye el Impacto en 1\",IF(AND(AE108>75,AE108<=100),\"Disminuye el Impacto en 2\",\"\")))))","v":"Disminuye la Probabilidad en 2"},{"$f":"IF(AE108<=50,0,IF(AND(AE108>50,AE108<=75),1,IF(AND(AE108>75,AE108<=100),2,\"\")))","v":2},"1. Aplicar los procedimientos de contratación\n2. Aplicar el Manual de Contratación","Jefe Oficina Jurídica",null,null,null,{"$f":"F108","v":2},{"$f":"IF(P108=\"Afecta la Probabilidad\",AM108-(AM108-AG108),\"No aplica\")","v":2},{"$f":"I108","v":4},{"$f":"IF(P108=\"Afecta el Impacto\",AO108-(AO108-AG108),\"No aplica\")","v":"No aplica"},{"$f":"IF(Matriz!P108=\"Afecta el Impacto\",CONCATENATE(AM108,AP108),CONCATENATE(AN108,AO108))","v":"24"},{"$f":"IF(P108=\"\",\"\",SUMIF(P108:P116,\"Afecta la Probabilidad\",AN108:AN116))","v":2},{"$f":"IF(P108=\"\",\"\",SUMIF(P108:P116,\"Afecta el Impacto\",AP108:AP116))","v":0},{"$f":"IF(AR108=\"\",\"\",IF(F108-AR108<=0,1,F108-AR108))","v":1},{"$f":"CONCATENATE(AT108,AV108)","v":"14"},{"$f":"IF(I108=\"\",\"\",IF(I108-AS108<0,1,I108-AS108))","v":4}]
[null,{"$f":"B108+1","v":2}]
[null,3]
[null,4]
[null,5]
[null,6]
[null,7]
[null,8]
[null,9]
["R13\nGESTIÓN JURÍDICA",1,"No presentar dentro del término procesal correspondiente los escritos, pruebas o recursos necesarios para efectuar la adecuada defensa judicial y extra judicial","Posibilidad de incurrir en prevaricato por Omisión","Sanciones legales\nResponsabilidad Penal\nProblemas de Complimiento Normativo\nPerdida de Confianza en el Instituto",2,{"$f":"IF(F117=5,\"Mas de una vez al año\",IF(F117=4,\"Al menos una vez en el ultimo año\",IF(F117=3,\"Al menos una vez en los ultimos 2 años\",IF(F117=2,\"Al menos una vez en los ultimos 5 años\",\"No se ha presentado en los ultimos 5 años\"))))","v":"Al menos una vez en los ultimos 5 años"},{"$f":"CONCATENATE(F$117,I$117)","v":"24"},4,{"$f":"IF(I117=5,\"Catastrófico\",IF(I117=4,\"Mayor\",IF(I117=3,\"Moderado\",IF(I117=2,\"Menor\",IF(I117=1,\"Leve\",\"Digite Valor entre 1 y 5\")))))","v":"Mayor"},{"$f":"IF(J117=\"Digite Valor entre 1 y 5\",\"\",IF(COUNTIF(BU$236:BU$243,CONCATENATE(F117,I117)),BU$235,IF(COUNTIF(BV$236:BV$243,CONCATENATE(F117,I117)),BV$235,IF(COUNTIF(BW$236:BW$239,CONCATENATE(F117,I117)),BW$235,BX$235))))","v":"Zona de Riesgo Alta"},{"$f":"IF(K117=BU$235,\"E\",IF(K117=BV$235,\"A\",IF(K117=BW$235,\"M\",IF(K117=BX$235,\"B\",\"\"))))","v":"A"},"Control Preventivo","1. Verificar el sistema Xpert/PQRS\n2. Preparar documentos claros defensa judicial\n3. Aplicar la Política de Defensa Judicial\n4. Aplicar el Código de Integridad","Continuo","Afecta la Probabilidad","Si",{"$f":"IF(Q117=\"Si\",15,0)","v":15},"Si",{"$f":"IF(S117=\"Si\",15,0)","v":15},"Oportuna",{"$f":"IF(U117=\"Oportuna\",15,0)","v":15},"Prevenir",{"$f":"IF(W117=\"Prevenir\",15,10)","v":15},"Confiable",{"$f":"IF(Y117=\"confiable\",15,0)","v":15},"Se investigan",{"$f":"IF(AA117=\"Se investigan\",15,0)","v":15},"Completa ",{"$f":"IF(AC117=\"Completa \",10,5)","v":10},{"$f":"R117+T117+V117+X117+Z117+AB117+AD117","v":100},{"$f":"IF(P117=\"\",\"\",IF(P117=\"Afecta la Probabilidad\",IF(AND(AE117>=0,AE117<=50),\"No disminuye la Probabilidad\",IF(AND(AE117>50,AE117<=75),\"Disminuye la Probabilidad en 1\",IF(AND(AE117>75,AE117<=100),\"Disminuye la Probabilidad en 2\",\"\"))),IF(AND(AE117>=0,AE117<=50),\"No disminuye el Impacto\",IF(AND(AE117>50,AE117<=75),\"Disminuye el Impacto en 1\",IF(AND(AE117>75,AE117<=100),\"Disminuye el Impacto en 2\",\"\")))))","v":"Disminuye la Probabilidad en 2"},{"$f":"IF(AE117<=50,0,IF(AND(AE117>50,AE117<=75),1,IF(AND(AE117>75,AE117<=100),2,\"\")))","v":2},"1. Verificar diariamente el sistema Xpert\n2. Implementar la Política de Defensa Judicial y sus acciones descritas en ella\n3. Aplicar los valores Institucionales 4 aplicar el imperio de  las leyes en el ejercicio contractual. ","Jefe Oficina Jurídica",null,null,null,{"$f":"F117","v":2},{"$f":"IF(P117=\"Afecta la Probabilidad\",AM117-(AM117-AG117),\"No aplica\")","v":2},{"$f":"I117","v":4},{"$f":"IF(P117=\"Afecta el Impacto\",AO117-(AO117-AG117),\"No aplica\")","v":"No aplica"},{"$f":"IF(Matriz!P117=\"Afecta el Impacto\",CONCATENATE(AM117,AP117),CONCATENATE(AN117,AO117))","v":"24"},{"$f":"IF(P117=\"\",\"\",SUMIF(P117:P125,\"Afecta la Probabilidad\",AN117:AN125))","v":2},{"$f":"IF(P117=\"\",\"\",SUMIF(P117:P125,\"Afecta el Impacto\",AP117:AP125))","v":0},{"$f":"IF(AR117=\"\",\"\",IF(F117-AR117<=0,1,F117-AR117))","v":1},{"$f":"CONCATENATE(AT117,AV117)","v":"14"},{"$f":"IF(I117=\"\",\"\",IF(I117-AS117<0,1,I117-AS117))","v":4}]
[null,2]
[null,3]
[null,4]
[null,5]
[null,6]
[null,7]
[null,8]
[null,9]
["R14",null,null,null,null,null,null,null,null,null,null,{"$f":"IF(K126=BU$235,\"E\",IF(K126=BV$235,\"A\",IF(K126=BW$235,\"M\",IF(K126=BX$235,\"B\",\"\"))))","v":""},null,null,null,null,null,{"$f":"IF(Q126=\"Si\",15,0)","v":0},null,{"$f":"IF(S126=\"Si\",15,0)","v":0},null,{"$f":"IF(U126=\"Oportuna\",15,0)","v":0},null,{"$f":"IF(W126=\"Prevenir\",15,10)","v":10},null,{"$f":"IF(Y126=\"confiable\",15,0)","v":0},null,{"$f":"IF(AA126=\"Se investigan\",15,0)","v":0},null,{"$f":"IF(AC126=\"Completa \",10,5)","v":5},{"$f":"R126+T126+V126+X126+Z126+AB126+AD126","v":15},{"$f":"IF(P126=\"\",\"\",IF(P126=\"Afecta la Probabilidad\",IF(AND(AE126>=0,AE126<=50),\"No disminuye la Probabilidad\",IF(AND(AE126>50,AE126<=75),\"Disminuye la Probabilidad en 1\",IF(AND(AE126>75,AE126<=100),\"Disminuye la Probabilidad en 2\",\"\"))),IF(AND(AE126>=0,AE126<=50),\"No disminuye el Impacto\",IF(AND(AE126>50,AE126<=75),\"Disminuye el Impacto en 1\",IF(AND(AE126>75,AE126<=100),\"Disminuye el Impacto en 2\",\"\")))))","v":""},{"$f":"IF(AE126<=50,0,IF(AND(AE126>50,AE126<=75),1,IF(AND(AE126>75,AE126<=100),2,\"\")))","v":0},null,null,null,null,null,{"$f":"F126","v":0}]
[]
[]
[]
[]
[]
[]
[]
[]
["R15",null,null,null,null,null,null,null,null,null,null,{"$f":"IF(K135=BU$235,\"E\",IF(K135=BV$235,\"A\",IF(K135=BW$235,\"M\",IF(K135=BX$235,\"B\",\"\"))))","v":""},null,null,null,null,null,{"$f":"IF(Q135=\"Si\",15,0)","v":0},null,{"$f":"IF(S135=\"Si\",15,0)","v":0},null,{"$f":"IF(U135=\"Oportuna\",15,0)","v":0},null,{"$f":"IF(W135=\"Prevenir\",15,10)","v":10},null,{"$f":"IF(Y135=\"confiable\",15,0)","v":0},null,{"$f":"IF(AA135=\"Se investigan\",15,0)","v":0},null,{"$f":"IF(AC135=\"Completa \",10,5)","v":5},{"$f":"R135+T135+V135+X135+Z135+AB135+AD135","v":15},{"$f":"IF(P135=\"\",\"\",IF(P135=\"Afecta la Probabilidad\",IF(AND(AE135>=0,AE135<=50),\"No disminuye la Probabilidad\",IF(AND(AE135>50,AE135<=75),\"Disminuye la Probabilidad en 1\",IF(AND(AE135>75,AE135<=100),\"Disminuye la Probabilidad en 2\",\"\"))),IF(AND(AE135>=0,AE135<=50),\"No disminuye el Impacto\",IF(AND(AE135>50,AE135<=75),\"Disminuye el Impacto en 1\",IF(AND(AE135>75,AE135<=100),\"Disminuye el Impacto en 2\",\"\")))))","v":""},{"$f":"IF(AE135<=50,0,IF(AND(AE135>50,AE135<=75),1,IF(AND(AE135>75,AE135<=100),2,\"\")))","v":0},null,null,null,null,null,{"$f":"F135","v":0}]
[]
[]
[]
[]
[]
[]
[]
[]
["R16"]
[]
[]
[]
[]
[]
[]
[]
[]
["R17"]
[]
[]
[]
[]
[]
[]
[]
[]
["R18"]
[]
[]
[]
[]
[]
[]
[]
[]
["R19"]
[]
[]
[]
[]
[]
[]
[]
[]
["R20"]
[]
[]
[]
[]
[]
[]
[]
[]
["R21"]
[]
[]
[]
[]
[]
[]
[]
[]
["R22"]
[]
[]
[]
[]
[]
[]
[]
[]
["R23"]
[]
[]
[]
[]
[]
[]
[]
[]
["R24"]
[]
[]
[]
[]
[]
[]
[]
[]
["R25"]
[]
[]
[]
[]
[]
[]
[]
[]
[null,null,null,null,null,null,null,null,null,null,null,null,null,null,null,null,null,null,null,null,null,null,null,null,null,null,null,null,null,null,null,null,null,null,null,null,null,null,null,null,null,null,null,null,null,null,null,null,null,null,null,null,null,null,null,null,null,null,null,null,null,null,null,null,null,null,null,null,null,null,null,null,"mapa de calor"]
[null,null,null,null,null,null,null,null,null,null,null,null,null,null,null,null,null,null,null,null,null,null,null,null,null,null,null,null,null,null,null,null,null,null,null,null,null,null,null,null,null,null,null,null,null,null,null,null,null,null,null,null,null,null,null,null,null,null,null,null,"Contexto",null,null,null,"Tabla de Probabilidad",null,null,null,null,"Impacto",null,null,"Zona de Riesgo Extrema","Zona de Riesgo Alta","Zona de Riesgo Moderada","Zona de Riesgo Baja",null,"FRECUENCIA DEL CONTROL",null,null,null,null,null,"RANGOS DE CALIFICACIÓN DE LOS CONTROLES ","DEPENDIENDO SI EL CONTROL AFECTA PROBABILIDAD O IMPACTO DESPLAZA EN LA MATRIZ DE EVALUACIÓN DEL RIESGO ASÍ: ",null,null,"TIPO DE CONTROL",null,"Controles de Gestión","Controles Operativos","Controles Legales",null,null,"TIPO DE CONTROL","DESCRIPCIÓN TIPO DE CONTROL"]
[null,null,null,null,null,null,null,null,null,null,null,10,null,null,null,null,null,null,null,null,null,null,null,null,null,null,null,null,null,null,null,null,null,null,null,null,null,null,null,null,null,null,null,null,null,null,null,null,null,null,null,null,null,null,null,null,null,null,null,null,"Externo","Interno","Del Proceso",null,"Nivel","Descriptor","Descripción","Frecuencia",null,"Catastrófico",5,null,25,14,13,11,null,"Mensual",null,"Afecta el Impacto",null,"Si",null,null,"En Probabilidad Avanza hacia abajo En Impacto Avanza hacia la izquierda CUADRANTES A DISMINUIR",null,null,"Controles_de_Gestion",null,"Políticas Claras Aplicadas","Conciliaciones","Normas Claras y Aplicadas",null,null,"Control Preventivo"]
[null,null,null,null,null,null,null,null,null,null,null,11,null,null,null,null,null,null,null,null,null,null,null,null,null,null,null,null,null,null,null,null,null,null,null,null,null,null,null,null,null,null,null,null,null,null,null,null,null,null,null,null,null,null,null,null,null,null,null,null,"Económicos","Financieros","Diseño del proceso",null,5,"Casi seguro","Se espera que el evento ocurra en la mayoría de las veces","Más de 1 vez al año.",null,"Mayor ",4,null,35,15,23,12,null,"Bimensual",null,"Afecta la Probabilidad",null,"No",null,"Entre 0-50",0,null,null,"Controles_Operativos",null,"Seguimiento al plan Estratégico y Operativo","Consecutivos","Control de Términos",null,null,"Control Correctivo"]
[null,null,null,null,null,null,null,null,null,null,null,12,null,null,null,null,null,null,null,null,null,null,null,null,null,null,null,null,null,null,null,null,null,null,null,null,null,null,null,null,null,null,null,null,null,null,null,null,null,null,null,null,null,null,null,null,null,null,null,null,"Políticos","Personal","Interacciones con otros procesos",null,4,"Probable","Es variable que el evento ocurra en la mayoría de las circunstancias","Al menos de 1 vez en el último año",null,"Moderado",3,null,45,24,32,21,null,"Trimestral",null,"SE BORRO SI",null,"Adecuado",null,"Entre 51-75",1,null,null,"Controles_Legales",null,"Indicador de Gestión","Verificación de Firmas",null,null,null,"Control Detectivo"]
[null,null,null,null,null,null,null,null,null,null,null,13,null,null,null,null,null,null,null,null,null,null,null,null,null,null,null,null,null,null,null,null,null,null,null,null,null,null,null,null,null,null,null,null,null,null,null,null,null,null,null,null,null,null,null,null,null,null,null,null,"Sociales","Procesos","Transversalidad",null,3,"Posible","El evento podrá ocurrir en algún momento","Al menos de 1 vez en los últimos 2 años",null,"Menos ",2,null,55,33,41,22,null,"Semestral",null,null,null,"Inadecuado",null,"Entre 76-100",2,null,null,null,null,"Seguimiento al cronograma","Lista de Chequeo"]
[null,null,null,null,null,null,null,null,null,null,null,14,null,null,null,null,null,null,null,null,null,null,null,null,null,null,null,null,null,null,null,null,null,null,null,null,null,null,null,null,null,null,null,null,null,null,null,null,null,null,null,null,null,null,null,null,null,null,null,null,"Tecnológicos","Tecnología","Procedimientos asociados",null,2,"Improbable","El evento puede ocurrir en algún momento","Al menos de 1 vez en los últimos 5 años",null,"Insignificante",1,null,34,42,null,31,null,"Anual",null,null,null,"Oportuna",null,null,null,null,null,null,null,"Informes de Gestión","Registro Controlado"]
[null,null,null,null,null,null,null,null,null,null,null,15,null,null,null,null,null,null,null,null,null,null,null,null,null,null,null,null,null,null,null,null,null,null,null,null,null,null,null,null,null,null,null,null,null,null,null,null,null,null,null,null,null,null,null,null,null,null,null,null,"Medioambientales","Estratégicos","Responsables de proceso",null,1,"Rara Vez","El evento puede ocurrir solo en circunstancias excepcionales\n ( poco comunes o anormales)","No se ha presentado en los últimos 5 años",null,null,null,null,44,43,null,null,null,"A Solicitud",null,null,null,"Inoportuna",null,null,null,null,null,null,null,null,"Segregación de Funciones"]
[null,null,null,null,null,null,null,null,null,null,null,16,null,null,null,null,null,null,null,null,null,null,null,null,null,null,null,null,null,null,null,null,null,null,null,null,null,null,null,null,null,null,null,null,null,null,null,null,null,null,null,null,null,null,null,null,null,null,null,null,"Comunicación externa","Comunicación interna","Comunicación entre procesos",null,null,null,null,null,null,null,null,null,54,51,null,null,null,"Continuo",null,null,null,"Prevenir",null,null,null,null,null,null,null,null,"Niveles de Autorización"]
[null,null,null,null,null,null,null,null,null,null,null,17,null,null,null,null,null,null,null,null,null,null,null,null,null,null,null,null,null,null,null,null,null,null,null,null,null,null,null,null,null,null,null,null,null,null,null,null,null,null,null,null,null,null,null,null,null,null,null,null,null,null,null,null,null,null,null,null,null,null,null,null,53,52,null,null,null,null,null,null,null,"Detectar",null,null,null,null,null,null,null,null,"Custodia Apropiada"]
[null,null,null,null,null,null,null,null,null,null,null,null,null,null,null,null,null,null,null,null,null,null,null,null,null,null,null,null,null,null,null,null,null,null,null,null,null,null,null,null,null,null,null,null,null,null,null,null,null,null,null,null,null,null,null,null,null,null,null,null,null,null,null,null,null,null,null,null,null,null,null,null,null,null,null,null,null,null,null,null,null,"No es control",null,null,null,null,null,null,null,null,"Procedimientos Formales aplicados"]
[null,null,null,null,null,null,null,null,null,null,null,null,null,null,null,null,null,null,null,null,null,null,null,null,null,null,null,null,null,null,null,null,null,null,null,null,null,null,null,null,null,null,null,null,null,null,null,null,null,null,null,null,null,null,null,null,null,null,null,null,null,null,null,null,null,null,null,null,null,null,null,null,null,null,null,null,null,null,null,null,null,"Confiable",null,null,null,null,null,null,null,null,"Pólizas"]
[null,null,null,null,null,null,null,null,null,null,null,null,null,null,null,null,null,null,null,null,null,null,null,null,null,null,null,null,null,null,null,null,null,null,null,null,null,null,null,null,null,null,null,null,null,null,null,null,null,null,null,null,null,null,null,null,null,null,null,null,null,null,null,null,null,null,null,null,null,null,null,null,null,null,null,null,null,null,null,null,null,"No confiable",null,null,null,null,null,null,null,null,"Seguridad Física"]
[null,null,null,null,null,null,null,null,null,null,null,null,null,null,null,null,null,null,null,null,null,null,null,null,null,null,null,null,null,null,null,null,null,null,null,null,null,null,null,null,null,null,null,null,null,null,null,null,null,null,null,null,null,null,null,null,null,null,null,null,null,null,null,null,null,null,null,null,null,null,null,null,null,null,null,null,null,null,null,null,null,"Se investigan",null,null,null,null,null,null,null,null,"Contingencias y Respaldo"]
[null,null,null,null,null,null,null,null,null,null,null,null,null,null,null,null,null,null,null,null,null,null,null,null,null,null,null,null,null,null,null,null,null,null,null,null,null,null,null,null,null,null,null,null,null,null,null,null,null,null,null,null,null,null,null,null,null,null,null,null,null,null,null,null,null,null,null,null,null,null,null,null,null,null,null,null,null,null,null,null,null,"No se Investigan",null,null,null,null,null,null,null,null,"Personal Capacitado"]
[null,null,null,null,null,null,null,null,null,null,null,null,null,null,null,null,null,null,null,null,null,null,null,null,null,null,null,null,null,null,null,null,null,null,null,null,null,null,null,null,null,null,null,null,null,null,null,null,null,null,null,null,null,null,null,null,null,null,null,null,null,null,null,null,null,null,null,null,null,null,null,null,null,null,null,null,null,null,null,null,null,"Completa ",null,null,null,null,null,null,null,null,"Aseguramiento y Calidad"]
[null,null,null,null,null,null,null,null,null,null,null,null,null,null,null,null,null,null,null,null,null,null,null,null,null,null,null,null,null,null,null,null,null,null,null,null,null,null,null,null,null,null,null,null,null,null,null,null,null,null,null,null,null,null,null,null,null,null,null,null,null,null,null,null,null,null,null,null,null,null,null,null,null,null,null,null,null,null,null,null,null,"Incompleta"]
[null,null,null,null,null,null,null,null,null,null,null,null,null,null,null,null,null,null,null,null,null,null,null,null,null,null,null,null,null,null,null,null,null,null,null,null,null,null,null,null,null,null,null,null,null,null,null,null,null,null,null,null,null,null,null,null,null,null,null,null,null,null,null,null,null,null,null,null,null,null,null,null,null,null,null,null,null,null,null,null,null,"No existe"]

{"sheet":"Mapa Riesgo Inherente ","index":3,"n_rows":30,"n_cols":37,"rows_kept":30,"cut":false,"hidden":false,"merged":[[43,31,43,33],[46,31,46,33],[49,31,49,33],[3,2,3,3],[32,30,37,33],[3,4,3,8],[3,9,3,13],[4,2,4,3],[40,31,40,33],[3,14,3,18],[3,19,3,23],[3,24,3,28],[16,3,18,3],[16,2,18,2],[21,2,23,2],[21,3,23,3],[1,2,1,28],[5,1,29,1],[2,4,2,8],[2,9,2,13],[2,14,2,18],[2,19,2,23],[2,24,2,28],[11,3,13,3],[11,2,13,2],[6,2,8,2],[6,3,8,3],[26,3,28,3],[26,2,28,2]]}
[]
[null,null,"IMPACTO"]
[null,null,null,null,1,null,null,null,null,2,null,null,null,null,3,null,null,null,null,4,null,null,null,null,5]
[null,null,null,null,"INSIGNIFICANTE",null,null,null,null,"MENOR",null,null,null,null,"MODERADO",null,null,null,null,"MAYOR",null,null,null,null,"CATASTRÓFICO"]
[]
[null,"PROBABILIDAD",null,null,{"$f":"IF(CONCATENATE(C$7,E$3)=Matriz!$H$9,CONCATENATE(Matriz!A9,\" - P1 I1\"),\"\")","v":""},{"$f":"IF(CONCATENATE(C$7,E$3)=Matriz!$H$54,CONCATENATE(Matriz!A54,\" - P1 I1\"),\"\")","v":""},{"$f":"IF(CONCATENATE(C$7,E$3)=Matriz!$H$99,CONCATENATE(Matriz!A99,\" - P1 I1\"),\"\")","v":""},{"$f":"IF(CONCATENATE(C$7,E$3)=Matriz!$H$144,CONCATENATE(Matriz!A144,\" - P1 I1\"),\"\")","v":""},{"$f":"IF(CONCATENATE(C$7,E$3)=Matriz!$H$189,CONCATENATE(Matriz!A189,\" - P1 I1\"),\"\")","v":""},{"$f":"IF(CONCATENATE(C$7,J$3)=Matriz!$H$9,CONCATENATE(Matriz!A9,\" - P1 I2\"),\"\")","v":""},{"$f":"IF(CONCATENATE(C$7,J$3)=Matriz!$H$54,CONCATENATE(Matriz!A54,\" - P1 I2\"),\"\")","v":""},{"$f":"IF(CONCATENATE(C$7,J$3)=Matriz!$H$99,CONCATENATE(Matriz!A99,\" - P1 I2\"),\"\")","v":""},{"$f":"IF(CONCATENATE(C$7,J$3)=Matriz!$H$144,CONCATENATE(Matriz!A144,\" - P1 I2\"),\"\")","v":""},{"$f":"IF(CONCATENATE(C$7,J$3)=Matriz!$H$189,CONCATENATE(Matriz!A189,\" - P1 I2\"),\"\")","v":""},{"$f":"IF(CONCATENATE(C$7,O$3)=Matriz!$H$9,CONCATENATE(Matriz!A9,\" - P1 I3\"),\"\")","v":""},{"$f":"IF(CONCATENATE(C$7,O$3)=Matriz!$H$54,CONCATENATE(Matriz!A54,\" - P1 I3\"),\"\")","v":""},{"$f":"IF(CONCATENATE(C$7,O$3)=Matriz!$H$99,CONCATENATE(Matriz!A99,\" - P1 I3\"),\"\")","v":""},{"$f":"IF(CONCATENATE(C$7,O$3)=Matriz!$H$144,CONCATENATE(Matriz!A144,\" - P1 I3\"),\"\")","v":""},{"$f":"IF(CONCATENATE(C$7,O$3)=Matriz!$H$189,CONCATENATE(Matriz!A189,\" - P1 I3\"),\"\")","v":""},{"$f":"IF(CONCATENATE(C$7,T$3)=Matriz!$H$9,CONCATENATE(Matriz!A9,\" - P1 I4\"),\"\")","v":""},{"$f":"IF(CONCATENATE(C$7,T$3)=Matriz!$H$54,CONCATENATE(Matriz!A54,\" - P1 I4\"),\"\")","v":""},{"$f":"IF(CONCATENATE(C$7,T$3)=Matriz!$H$99,CONCATENATE(Matriz!A99,\" - P1 I4\"),\"\")","v":""},{"$f":"IF(CONCATENATE(C$7,T$3)=Matriz!$H$144,CONCATENATE(Matriz!A144,\" - P1 I4\"),\"\")","v":""},{"$f":"IF(CONCATENATE(C$7,T$3)=Matriz!$H$189,CONCATENATE(Matriz!A189,\" - P1 I4\"),\"\")","v":""},{"$f":"IF(CONCATENATE(C$7,Y$3)=Matriz!$H$9,CONCATENATE(Matriz!A9,\" - P1 I5\"),\"\")","v":""},{"$f":"IF(CONCATENATE(C$7,Y$3)=Matriz!$H$54,CONCATENATE(Matriz!A54,\" - P1 I5\"),\"\")","v":""},{"$f":"IF(CONCATENATE(C$7,Y$3)=Matriz!$H$99,CONCATENATE(Matriz!A99,\" - P1 I5\"),\"\")","v":""},{"$f":"IF(CONCATENATE(C$7,Y$3)=Matriz!$H$144,CONCATENATE(Matriz!A144,\" - P1 I5\"),\"\")","v":""},{"$f":"IF(CONCATENATE(C$7,Y$3)=Matriz!$H$189,CONCATENATE(Matriz!A189,\" - P1 I5\"),\"\")","v":""},null,null,null,null,null,9,1,{"$f":"AJ6*AI6","v":9}]
[null,null,5,"CASI SEGURO",{"$f":"IF(CONCATENATE(C$7,E$3)=Matriz!$H$18,CONCATENATE(Matriz!A18,\" - P1 I1\"),\"\")","v":""},{"$f":"IF(CONCATENATE(C$7,E$3)=Matriz!$H$63,CONCATENATE(Matriz!A63,\" - P1 I1\"),\"\")","v":""},{"$f":"IF(CONCATENATE(C$7,E$3)=Matriz!$H$108,CONCATENATE(Matriz!A108,\" - P1 I1\"),\"\")","v":""},{"$f":"IF(CONCATENATE(C$7,E$3)=Matriz!$H$153,CONCATENATE(Matriz!A153,\" - P1 I1\"),\"\")","v":""},{"$f":"IF(CONCATENATE(C$7,E$3)=Matriz!$H$198,CONCATENATE(Matriz!A198,\" - P1 I1\"),\"\")","v":""},{"$f":"IF(CONCATENATE(C$7,J$3)=Matriz!$H$18,CONCATENATE(Matriz!A18,\" - P1 I2\"),\"\")","v":""},{"$f":"IF(CONCATENATE(C$7,J$3)=Matriz!$H$63,CONCATENATE(Matriz!A63,\" - P1 I2\"),\"\")","v":""},{"$f":"IF(CONCATENATE(C$7,J$3)=Matriz!$H$108,CONCATENATE(Matriz!A108,\" - P1 I2\"),\"\")","v":""},{"$f":"IF(CONCATENATE(C$7,J$3)=Matriz!$H$153,CONCATENATE(Matriz!A153,\" - P1 I2\"),\"\")","v":""},{"$f":"IF(CONCATENATE(C$7,J$3)=Matriz!$H$198,CONCATENATE(Matriz!A198,\" - P1 I2\"),\"\")","v":""},{"$f":"IF(CONCATENATE(C$7,O$3)=Matriz!$H$18,CONCATENATE(Matriz!A18,\" - P1 I3\"),\"\")","v":""},{"$f":"IF(CONCATENATE(C$7,O$3)=Matriz!$H$63,CONCATENATE(Matriz!A63,\" - P1 I3\"),\"\")","v":""},{"$f":"IF(CONCATENATE(C$7,O$3)=Matriz!$H$108,CONCATENATE(Matriz!A108,\" - P1 I3\"),\"\")","v":""},{"$f":"IF(CONCATENATE(C$7,O$3)=Matriz!$H$153,CONCATENATE(Matriz!A153,\" - P1 I3\"),\"\")","v":""},{"$f":"IF(CONCATENATE(C$7,O$3)=Matriz!$H$198,CONCATENATE(Matriz!A198,\" - P1 I3\"),\"\")","v":""},{"$f":"IF(CONCATENATE(C$7,T$3)=Matriz!$H$18,CONCATENATE(Matriz!A18,\" - P1 I4\"),\"\")","v":""},{"$f":"IF(CONCATENATE(C$7,T$3)=Matriz!$H$63,CONCATENATE(Matriz!A63,\" - P1 I4\"),\"\")","v":""},{"$f":"IF(CONCATENATE(C$7,T$3)=Matriz!$H$108,CONCATENATE(Matriz!A108,\" - P1 I4\"),\"\")","v":""},{"$f":"IF(CONCATENATE(C$7,T$3)=Matriz!$H$153,CONCATENATE(Matriz!A153,\" - P1 I4\"),\"\")","v":""},{"$f":"IF(CONCATENATE(C$7,T$3)=Matriz!$H$198,CONCATENATE(Matriz!A198,\" - P1 I4\"),\"\")","v":""},{"$f":"IF(CONCATENATE(C$7,Y$3)=Matriz!$H$18,CONCATENATE(Matriz!A18,\" - P1 I5\"),\"\")","v":""},{"$f":"IF(CONCATENATE(C$7,Y$3)=Matriz!$H$63,CONCATENATE(Matriz!A63,\" - P1 I5\"),\"\")","v":""},{"$f":"IF(CONCATENATE(C$7,Y$3)=Matriz!$H$108,CONCATENATE(Matriz!A108,\" - P1 I5\"),\"\")","v":""},{"$f":"IF(CONCATENATE(C$7,Y$3)=Matriz!$H$153,CONCATENATE(Matriz!A153,\" - P1 I5\"),\"\")","v":""},{"$f":"IF(CONCATENATE(C$7,Y$3)=Matriz!$H$198,CONCATENATE(Matriz!A198,\" - P1 I5\"),\"\")","v":""},null,null,null,null,null,9,2,{"$f":"AJ7*AI7","v":18}]
[null,null,null,null,{"$f":"IF(CONCATENATE(C$7,E$3)=Matriz!$H$27,CONCATENATE(Matriz!A27,\" - P1 I1\"),\"\")","v":""},{"$f":"IF(CONCATENATE(C$7,E$3)=Matriz!$H$72,CONCATENATE(Matriz!A72,\" - P1 I1\"),\"\")","v":""},{"$f":"IF(CONCATENATE(C$7,E$3)=Matriz!$H$117,CONCATENATE(Matriz!A117,\" - P1 I1\"),\"\")","v":""},{"$f":"IF(CONCATENATE(C$7,E$3)=Matriz!$H$162,CONCATENATE(Matriz!A162,\" - P1 I1\"),\"\")","v":""},{"$f":"IF(CONCATENATE(C$7,E$3)=Matriz!$H$207,CONCATENATE(Matriz!A207,\" - P1 I1\"),\"\")","v":""},{"$f":"IF(CONCATENATE(C$7,J$3)=Matriz!$H$27,CONCATENATE(Matriz!A27,\" - P1 I2\"),\"\")","v":""},{"$f":"IF(CONCATENATE(C$7,J$3)=Matriz!$H$72,CONCATENATE(Matriz!A72,\" - P1 I2\"),\"\")","v":""},{"$f":"IF(CONCATENATE(C$7,J$3)=Matriz!$H$117,CONCATENATE(Matriz!A117,\" - P1 I2\"),\"\")","v":""},{"$f":"IF(CONCATENATE(C$7,J$3)=Matriz!$H$162,CONCATENATE(Matriz!A162,\" - P1 I2\"),\"\")","v":""},{"$f":"IF(CONCATENATE(C$7,J$3)=Matriz!$H$207,CONCATENATE(Matriz!A207,\" - P1 I2\"),\"\")","v":""},{"$f":"IF(CONCATENATE(C$7,O$3)=Matriz!$H$27,CONCATENATE(Matriz!A27,\" - P1 I3\"),\"\")","v":""},{"$f":"IF(CONCATENATE(C$7,O$3)=Matriz!$H$72,CONCATENATE(Matriz!A72,\" - P1 I3\"),\"\")","v":""},{"$f":"IF(CONCATENATE(C$7,O$3)=Matriz!$H$117,CONCATENATE(Matriz!A117,\" - P1 I3\"),\"\")","v":""},{"$f":"IF(CONCATENATE(C$7,O$3)=Matriz!$H$162,CONCATENATE(Matriz!A162,\" - P1 I3\"),\"\")","v":""},{"$f":"IF(CONCATENATE(C$7,O$3)=Matriz!$H$207,CONCATENATE(Matriz!A207,\" - P1 I3\"),\"\")","v":""},{"$f":"IF(CONCATENATE(C$7,T$3)=Matriz!$H$27,CONCATENATE(Matriz!A27,\" - P1 I4\"),\"\")","v":""},{"$f":"IF(CONCATENATE(C$7,T$3)=Matriz!$H$72,CONCATENATE(Matriz!A72,\" - P1 I4\"),\"\")","v":""},{"$f":"IF(CONCATENATE(C$7,T$3)=Matriz!$H$117,CONCATENATE(Matriz!A117,\" - P1 I4\"),\"\")","v":""},{"$f":"IF(CONCATENATE(C$7,T$3)=Matriz!$H$162,CONCATENATE(Matriz!A162,\" - P1 I4\"),\"\")","v":""},{"$f":"IF(CONCATENATE(C$7,T$3)=Matriz!$H$207,CONCATENATE(Matriz!A207,\" - P1 I4\"),\"\")","v":""},{"$f":"IF(CONCATENATE(C$7,Y$3)=Matriz!$H$27,CONCATENATE(Matriz!A27,\" - P1 I5\"),\"\")","v":""},{"$f":"IF(CONCATENATE(C$7,Y$3)=Matriz!$H$72,CONCATENATE(Matriz!A72,\" - P1 I5\"),\"\")","v":""},{"$f":"IF(CONCATENATE(C$7,Y$3)=Matriz!$H$117,CONCATENATE(Matriz!A117,\" - P1 I5\"),\"\")","v":""},{"$f":"IF(CONCATENATE(C$7,Y$3)=Matriz!$H$162,CONCATENATE(Matriz!A162,\" - P1 I5\"),\"\")","v":""},{"$f":"IF(CONCATENATE(C$7,Y$3)=Matriz!$H$207,CONCATENATE(Matriz!A207,\" - P1 I5\"),\"\")","v":""},null,null,null,null,null,9,3,27]
[null,null,null,null,{"$f":"IF(CONCATENATE(C$7,E$3)=Matriz!$H$36,CONCATENATE(Matriz!A36,\" - P1 I1\"),\"\")","v":""},{"$f":"IF(CONCATENATE(C$7,E$3)=Matriz!$H$81,CONCATENATE(Matriz!A81,\" - P1 I1\"),\"\")","v":""},{"$f":"IF(CONCATENATE(C$7,E$3)=Matriz!$H$126,CONCATENATE(Matriz!A126,\" - P1 I1\"),\"\")","v":""},{"$f":"IF(CONCATENATE(C$7,E$3)=Matriz!$H$171,CONCATENATE(Matriz!A171,\" - P1 I1\"),\"\")","v":""},{"$f":"IF(CONCATENATE(C$7,E$3)=Matriz!$H$216,CONCATENATE(Matriz!A216,\" - P1 I1\"),\"\")","v":""},{"$f":"IF(CONCATENATE(C$7,J$3)=Matriz!$H$36,CONCATENATE(Matriz!A36,\" - P1 I2\"),\"\")","v":""},{"$f":"IF(CONCATENATE(C$7,J$3)=Matriz!$H$81,CONCATENATE(Matriz!A81,\" - P1 I2\"),\"\")","v":""},{"$f":"IF(CONCATENATE(C$7,J$3)=Matriz!$H$126,CONCATENATE(Matriz!A126,\" - P1 I2\"),\"\")","v":""},{"$f":"IF(CONCATENATE(C$7,J$3)=Matriz!$H$171,CONCATENATE(Matriz!A171,\" - P1 I2\"),\"\")","v":""},{"$f":"IF(CONCATENATE(C$7,J$3)=Matriz!$H$216,CONCATENATE(Matriz!A216,\" - P1 I2\"),\"\")","v":""},{"$f":"IF(CONCATENATE(C$7,O$3)=Matriz!$H$36,CONCATENATE(Matriz!A36,\" - P1 I3\"),\"\")","v":""},{"$f":"IF(CONCATENATE(C$7,O$3)=Matriz!$H$81,CONCATENATE(Matriz!A81,\" - P1 I3\"),\"\")","v":""},{"$f":"IF(CONCATENATE(C$7,O$3)=Matriz!$H$126,CONCATENATE(Matriz!A126,\" - P1 I3\"),\"\")","v":""},{"$f":"IF(CONCATENATE(C$7,O$3)=Matriz!$H$171,CONCATENATE(Matriz!A171,\" - P1 I3\"),\"\")","v":""},{"$f":"IF(CONCATENATE(C$7,O$3)=Matriz!$H$216,CONCATENATE(Matriz!A216,\" - P1 I3\"),\"\")","v":""},{"$f":"IF(CONCATENATE(C$7,T$3)=Matriz!$H$36,CONCATENATE(Matriz!A36,\" - P1 I4\"),\"\")","v":""},{"$f":"IF(CONCATENATE(C$7,T$3)=Matriz!$H$81,CONCATENATE(Matriz!A81,\" - P1 I4\"),\"\")","v":""},{"$f":"IF(CONCATENATE(C$7,T$3)=Matriz!$H$126,CONCATENATE(Matriz!A126,\" - P1 I4\"),\"\")","v":""},{"$f":"IF(CONCATENATE(C$7,T$3)=Matriz!$H$171,CONCATENATE(Matriz!A171,\" - P1 I4\"),\"\")","v":""},{"$f":"IF(CONCATENATE(C$7,T$3)=Matriz!$H$216,CONCATENATE(Matriz!A216,\" - P1 I4\"),\"\")","v":""},{"$f":"IF(CONCATENATE(C$7,Y$3)=Matriz!$H$36,CONCATENATE(Matriz!A36,\" - P1 I5\"),\"\")","v":""},{"$f":"IF(CONCATENATE(C$7,Y$3)=Matriz!$H$81,CONCATENATE(Matriz!A81,\" - P1 I5\"),\"\")","v":""},{"$f":"IF(CONCATENATE(C$7,Y$3)=Matriz!$H$126,CONCATENATE(Matriz!A126,\" - P1 I5\"),\"\")","v":""},{"$f":"IF(CONCATENATE(C$7,Y$3)=Matriz!$H$171,CONCATENATE(Matriz!A171,\" - P1 I5\"),\"\")","v":""},{"$f":"IF(CONCATENATE(C$7,Y$3)=Matriz!$H$216,CONCATENATE(Matriz!A216,\" - P1 I5\"),\"\")","v":""},null,null,null,null,null,9,4,36]
[null,null,null,null,{"$f":"IF(CONCATENATE(B$7,D$3)=Matriz!$H$45,CONCATENATE(Matriz!A45,\" - P1 I1\"),\"\")","v":""},{"$f":"IF(CONCATENATE(C$7,E$3)=Matriz!$H$90,CONCATENATE(Matriz!A90,\" - P1 I1\"),\"\")","v":""},{"$f":"IF(CONCATENATE(C$7,E$3)=Matriz!$H$135,CONCATENATE(Matriz!A135,\" - P1 I1\"),\"\")","v":""},{"$f":"IF(CONCATENATE(C$7,E$3)=Matriz!$H$180,CONCATENATE(Matriz!A180,\" - P1 I1\"),\"\")","v":""},{"$f":"IF(CONCATENATE(C$7,E$3)=Matriz!$H$225,CONCATENATE(Matriz!A225,\" - P1 I1\"),\"\")","v":""},{"$f":"IF(CONCATENATE(C$7,J$3)=Matriz!$H$45,CONCATENATE(Matriz!A45,\" - P1 I2\"),\"\")","v":""},{"$f":"IF(CONCATENATE(C$7,J$3)=Matriz!$H$90,CONCATENATE(Matriz!A90,\" - P1 I2\"),\"\")","v":""},{"$f":"IF(CONCATENATE(C$7,J$3)=Matriz!$H$135,CONCATENATE(Matriz!A135,\" - P1 I2\"),\"\")","v":""},{"$f":"IF(CONCATENATE(C$7,J$3)=Matriz!$H$180,CONCATENATE(Matriz!A180,\" - P1 I2\"),\"\")","v":""},{"$f":"IF(CONCATENATE(C$7,J$3)=Matriz!$H$225,CONCATENATE(Matriz!A225,\" - P1 I2\"),\"\")","v":""},{"$f":"IF(CONCATENATE(C$7,O$3)=Matriz!$H$45,CONCATENATE(Matriz!A45,\" - P1 I3\"),\"\")","v":""},{"$f":"IF(CONCATENATE(C$7,O$3)=Matriz!$H$90,CONCATENATE(Matriz!A90,\" - P1 I3\"),\"\")","v":""},{"$f":"IF(CONCATENATE(C$7,O$3)=Matriz!$H$135,CONCATENATE(Matriz!A135,\" - P1 I3\"),\"\")","v":""},{"$f":"IF(CONCATENATE(C$7,O$3)=Matriz!$H$180,CONCATENATE(Matriz!A180,\" - P1 I3\"),\"\")","v":""},{"$f":"IF(CONCATENATE(C$7,O$3)=Matriz!$H$225,CONCATENATE(Matriz!A225,\" - P1 I3\"),\"\")","v":""},{"$f":"IF(CONCATENATE(C$7,T$3)=Matriz!$H$45,CONCATENATE(Matriz!A45,\" - P1 I4\"),\"\")","v":""},{"$f":"IF(CONCATENATE(C$7,T$3)=Matriz!$H$90,CONCATENATE(Matriz!A90,\" - P1 I4\"),\"\")","v":""},{"$f":"IF(CONCATENATE(C$7,T$3)=Matriz!$H$135,CONCATENATE(Matriz!A135,\" - P1 I4\"),\"\")","v":""},{"$f":"IF(CONCATENATE(C$7,T$3)=Matriz!$H$180,CONCATENATE(Matriz!A180,\" - P1 I4\"),\"\")","v":""},{"$f":"IF(CONCATENATE(C$7,T$3)=Matriz!$H$225,CONCATENATE(Matriz!A225,\" - P1 I4\"),\"\")","v":""},{"$f":"IF(CONCATENATE(C$7,Y$3)=Matriz!$H$45,CONCATENATE(Matriz!A45,\" - P1 I5\"),\"\")","v":""},{"$f":"IF(CONCATENATE(C$7,Y$3)=Matriz!$H$90,CONCATENATE(Matriz!A90,\" - P1 I5\"),\"\")","v":""},{"$f":"IF(CONCATENATE(C$7,Y$3)=Matriz!$H$135,CONCATENATE(Matriz!A135,\" - P1 I5\"),\"\")","v":""},{"$f":"IF(CONCATENATE(C$7,Y$3)=Matriz!$H$180,CONCATENATE(Matriz!A180,\" - P1 I5\"),\"\")","v":""},{"$f":"IF(CONCATENATE(C$7,Y$3)=Matriz!$H$225,CONCATENATE(Matriz!A225,\" - P1 I5\"),\"\")","v":""},null,null,null,null,null,9,5,45]
[null,null,null,null,{"$f":"IF(CONCATENATE(C$12,E$3)=Matriz!$H$9,CONCATENATE(Matriz!A9,\" - P2 I1\"),\"\")","v":""},{"$f":"IF(CONCATENATE(C$12,E$3)=Matriz!$H$54,CONCATENATE(Matriz!A54,\" - P2 I1\"),\"\")","v":""},{"$f":"IF(CONCATENATE(C$12,E$3)=Matriz!$H$99,CONCATENATE(Matriz!A99,\" - P2 I1\"),\"\")","v":""},{"$f":"IF(CONCATENATE(C$12,E$3)=Matriz!$H$144,CONCATENATE(Matriz!A144,\" - P2 I1\"),\"\")","v":""},{"$f":"IF(CONCATENATE(C$12,E$3)=Matriz!$H$189,CONCATENATE(Matriz!A189,\" - P2 I1\"),\"\")","v":""},{"$f":"IF(CONCATENATE(C$12,J$3)=Matriz!$H$9,CONCATENATE(Matriz!A9,\" - P2 I2\"),\"\")","v":""},{"$f":"IF(CONCATENATE(C$12,J$3)=Matriz!$H$54,CONCATENATE(Matriz!A54,\" - P2 I2\"),\"\")","v":""},{"$f":"IF(CONCATENATE(C$12,J$3)=Matriz!$H$99,CONCATENATE(Matriz!A99,\" - P2 I2\"),\"\")","v":""},{"$f":"IF(CONCATENATE(C$12,J$3)=Matriz!$H$144,CONCATENATE(Matriz!A144,\" - P2 I2\"),\"\")","v":""},{"$f":"IF(CONCATENATE(C$12,J$3)=Matriz!$H$189,CONCATENATE(Matriz!A189,\" - P2 I2\"),\"\")","v":""},{"$f":"IF(CONCATENATE(C$12,O$3)=Matriz!$H$9,CONCATENATE(Matriz!A9,\" - P2 I3\"),\"\")","v":""},{"$f":"IF(CONCATENATE(C$12,O$3)=Matriz!$H$54,CONCATENATE(Matriz!A54,\" - P2 I3\"),\"\")","v":""},{"$f":"IF(CONCATENATE(C$12,O$3)=Matriz!$H$99,CONCATENATE(Matriz!A99,\" - P2 I3\"),\"\")","v":""},{"$f":"IF(CONCATENATE(C$12,O$3)=Matriz!$H$144,CONCATENATE(Matriz!A144,\" - P2 I3\"),\"\")","v":""},{"$f":"IF(CONCATENATE(C$12,O$3)=Matriz!$H$189,CONCATENATE(Matriz!A189,\" - P2 I3\"),\"\")","v":""},{"$f":"IF(CONCATENATE(C$12,T$3)=Matriz!$H$9,CONCATENATE(Matriz!A9,\" - P2 I4\"),\"\")","v":""},{"$f":"IF(CONCATENATE(C$12,T$3)=Matriz!$H$45,CONCATENATE(Matriz!A45,\" - P2 I4\"),\"\")","v":""},null,null,{"$f":"IF(CONCATENATE(C$12,T$3)=Matriz!$H$81,CONCATENATE(Matriz!A81,\" - P2 I4\"),\"\")","v":""},{"$f":"IF(CONCATENATE(C$12,Y$3)=Matriz!$H$9,CONCATENATE(Matriz!A9,\" - P2 I5\"),\"\")","v":""},{"$f":"IF(CONCATENATE(C$12,Y$3)=Matriz!$H$54,CONCATENATE(Matriz!A54,\" - P2 I5\"),\"\")","v":""},{"$f":"IF(CONCATENATE(C$12,Y$3)=Matriz!$H$99,CONCATENATE(Matriz!A99,\" - P2 I5\"),\"\")","v":""},{"$f":"IF(CONCATENATE(C$12,Y$3)=Matriz!$H$144,CONCATENATE(Matriz!A144,\" - P2 I5\"),\"\")","v":""},{"$f":"IF(CONCATENATE(C$12,Y$3)=Matriz!$H$189,CONCATENATE(Matriz!A189,\" - P2 I5\"),\"\")","v":""},null,null,null,null,null,9,6,54]
[null,null,4,"PROBABLE",{"$f":"IF(CONCATENATE(C$12,E$3)=Matriz!$H$18,CONCATENATE(Matriz!A18,\" - P2 I1\"),\"\")","v":""},{"$f":"IF(CONCATENATE(C$12,E$3)=Matriz!$H$63,CONCATENATE(Matriz!A63,\" - P2 I1\"),\"\")","v":""},{"$f":"IF(CONCATENATE(C$12,E$3)=Matriz!$H$108,CONCATENATE(Matriz!A108,\" - P2 I1\"),\"\")","v":""},{"$f":"IF(CONCATENATE(C$12,E$3)=Matriz!$H$153,CONCATENATE(Matriz!A153,\" - P2 I1\"),\"\")","v":""},{"$f":"IF(CONCATENATE(C$12,E$3)=Matriz!$H$198,CONCATENATE(Matriz!A198,\" - P2 I1\"),\"\")","v":""},{"$f":"IF(CONCATENATE(C$12,J$3)=Matriz!$H$18,CONCATENATE(Matriz!A18,\" - P2 I2\"),\"\")","v":""},{"$f":"IF(CONCATENATE(C$12,J$3)=Matriz!$H$63,CONCATENATE(Matriz!A63,\" - P2 I2\"),\"\")","v":""},{"$f":"IF(CONCATENATE(C$12,J$3)=Matriz!$H$108,CONCATENATE(Matriz!A108,\" - P2 I2\"),\"\")","v":""},{"$f":"IF(CONCATENATE(C$12,J$3)=Matriz!$H$153,CONCATENATE(Matriz!A153,\" - P2 I2\"),\"\")","v":""},{"$f":"IF(CONCATENATE(C$12,J$3)=Matriz!$H$198,CONCATENATE(Matriz!A198,\" - P2 I2\"),\"\")","v":""},{"$f":"IF(CONCATENATE(C$12,O$3)=Matriz!$H$18,CONCATENATE(Matriz!A18,\" - P2 I3\"),\"\")","v":""},{"$f":"IF(CONCATENATE(C$12,O$3)=Matriz!$H$63,CONCATENATE(Matriz!A63,\" - P2 I3\"),\"\")","v":""},{"$f":"IF(CONCATENATE(C$12,O$3)=Matriz!$H$108,CONCATENATE(Matriz!A108,\" - P2 I3\"),\"\")","v":""},{"$f":"IF(CONCATENATE(C$12,O$3)=Matriz!$H$153,CONCATENATE(Matriz!A153,\" - P2 I3\"),\"\")","v":""},{"$f":"IF(CONCATENATE(C$12,O$3)=Matriz!$H$198,CONCATENATE(Matriz!A198,\" - P2 I3\"),\"\")","v":""},{"$f":"IF(CONCATENATE(C$12,T$3)=Matriz!$H$18,CONCATENATE(Matriz!A18,\" - P2 I4\"),\"\")","v":""},{"$f":"IF(CONCATENATE(C$12,T$3)=Matriz!$H$54,CONCATENATE(Matriz!A54,\" - P2 I4\"),\"\")","v":""},null,null,{"$f":"IF(CONCATENATE(C$12,T$3)=Matriz!$H$90,CONCATENATE(Matriz!A90,\" - P2 I4\"),\"\")","v":""},{"$f":"IF(CONCATENATE(C$12,Y$3)=Matriz!$H$18,CONCATENATE(Matriz!A18,\" - P2 I5\"),\"\")","v":""},{"$f":"IF(CONCATENATE(C$12,Y$3)=Matriz!$H$63,CONCATENATE(Matriz!A63,\" - P2 I5\"),\"\")","v":""},{"$f":"IF(CONCATENATE(C$12,Y$3)=Matriz!$H$108,CONCATENATE(Matriz!A108,\" - P2 I5\"),\"\")","v":""},{"$f":"IF(CONCATENATE(C$12,Y$3)=Matriz!$H$153,CONCATENATE(Matriz!A153,\" - P2 I5\"),\"\")","v":""},{"$f":"IF(CONCATENATE(C$12,Y$3)=Matriz!$H$198,CONCATENATE(Matriz!A198,\" - P2 I5\"),\"\")","v":""},null,null,null,null,null,9,7,63]
[null,null,null,null,{"$f":"IF(CONCATENATE(C$12,E$3)=Matriz!$H$27,CONCATENATE(Matriz!A27,\" - P2 I1\"),\"\")","v":""},{"$f":"IF(CONCATENATE(C$12,E$3)=Matriz!$H$72,CONCATENATE(Matriz!A72,\" - P2 I1\"),\"\")","v":""},{"$f":"IF(CONCATENATE(C$12,E$3)=Matriz!$H$117,CONCATENATE(Matriz!A117,\" - P2 I1\"),\"\")","v":""},{"$f":"IF(CONCATENATE(C$12,E$3)=Matriz!$H$162,CONCATENATE(Matriz!A162,\" - P2 I1\"),\"\")","v":""},{"$f":"IF(CONCATENATE(C$12,E$3)=Matriz!$H$207,CONCATENATE(Matriz!A207,\" - P2 I1\"),\"\")","v":""},{"$f":"IF(CONCATENATE(C$12,J$3)=Matriz!$H$27,CONCATENATE(Matriz!A27,\" - P2 I2\"),\"\")","v":""},{"$f":"IF(CONCATENATE(C$12,J$3)=Matriz!$H$72,CONCATENATE(Matriz!A72,\" - P2 I2\"),\"\")","v":""},{"$f":"IF(CONCATENATE(C$12,J$3)=Matriz!$H$117,CONCATENATE(Matriz!A117,\" - P2 I2\"),\"\")","v":""},{"$f":"IF(CONCATENATE(C$12,J$3)=Matriz!$H$162,CONCATENATE(Matriz!A162,\" - P2 I2\"),\"\")","v":""},{"$f":"IF(CONCATENATE(C$12,J$3)=Matriz!$H$207,CONCATENATE(Matriz!A207,\" - P2 I2\"),\"\")","v":""},{"$f":"IF(CONCATENATE(C$12,O$3)=Matriz!$H$27,CONCATENATE(Matriz!A27,\" - P2 I3\"),\"\")","v":""},{"$f":"IF(CONCATENATE(C$12,O$3)=Matriz!$H$72,CONCATENATE(Matriz!A72,\" - P2 I3\"),\"\")","v":""},{"$f":"IF(CONCATENATE(C$12,O$3)=Matriz!$H$117,CONCATENATE(Matriz!A117,\" - P2 I3\"),\"\")","v":""},{"$f":"IF(CONCATENATE(C$12,O$3)=Matriz!$H$162,CONCATENATE(Matriz!A162,\" - P2 I3\"),\"\")","v":""},{"$f":"IF(CONCATENATE(C$12,O$3)=Matriz!$H$207,CONCATENATE(Matriz!A207,\" - P2 I3\"),\"\")","v":""},{"$f":"IF(CONCATENATE(C$12,T$3)=Matriz!$H$27,CONCATENATE(Matriz!A27,\" - P2 I4\"),\"\")","v":""},{"$f":"IF(CONCATENATE(C$12,T$3)=Matriz!$H$63,CONCATENATE(Matriz!A63,\" - P2 I4\"),\"\")","v":""},null,null,{"$f":"IF(CONCATENATE(C$12,T$3)=Matriz!$H$99,CONCATENATE(Matriz!A99,\" - P2 I4\"),\"\")","v":""},{"$f":"IF(CONCATENATE(C$12,Y$3)=Matriz!$H$27,CONCATENATE(Matriz!A27,\" - P2 I5\"),\"\")","v":""},{"$f":"IF(CONCATENATE(C$12,Y$3)=Matriz!$H$72,CONCATENATE(Matriz!A72,\" - P2 I5\"),\"\")","v":""},{"$f":"IF(CONCATENATE(C$12,Y$3)=Matriz!$H$117,CONCATENATE(Matriz!A117,\" - P2 I5\"),\"\")","v":""},{"$f":"IF(CONCATENATE(C$12,Y$3)=Matriz!$H$162,CONCATENATE(Matriz!A162,\" - P2 I5\"),\"\")","v":""},{"$f":"IF(CONCATENATE(C$12,Y$3)=Matriz!$H$207,CONCATENATE(Matriz!A207,\" - P2 I5\"),\"\")","v":""},null,null,null,null,null,9,8,72]
[null,null,null,null,{"$f":"IF(CONCATENATE(C$12,E$3)=Matriz!$H$36,CONCATENATE(Matriz!A36,\" - P2 I1\"),\"\")","v":""},{"$f":"IF(CONCATENATE(C$12,E$3)=Matriz!$H$81,CONCATENATE(Matriz!A81,\" - P2 I1\"),\"\")","v":""},{"$f":"IF(CONCATENATE(C$12,E$3)=Matriz!$H$126,CONCATENATE(Matriz!A126,\" - P2 I1\"),\"\")","v":""},{"$f":"IF(CONCATENATE(C$12,E$3)=Matriz!$H$171,CONCATENATE(Matriz!A171,\" - P2 I1\"),\"\")","v":""},{"$f":"IF(CONCATENATE(C$12,E$3)=Matriz!$H$216,CONCATENATE(Matriz!A216,\" - P2 I1\"),\"\")","v":""},{"$f":"IF(CONCATENATE(C$12,J$3)=Matriz!$H$36,CONCATENATE(Matriz!A36,\" - P2 I2\"),\"\")","v":""},{"$f":"IF(CONCATENATE(C$12,J$3)=Matriz!$H$81,CONCATENATE(Matriz!A81,\" - P2 I2\"),\"\")","v":""},{"$f":"IF(CONCATENATE(C$12,J$3)=Matriz!$H$126,CONCATENATE(Matriz!A126,\" - P2 I2\"),\"\")","v":""},{"$f":"IF(CONCATENATE(C$12,J$3)=Matriz!$H$171,CONCATENATE(Matriz!A171,\" - P2 I2\"),\"\")","v":""},{"$f":"IF(CONCATENATE(C$12,J$3)=Matriz!$H$216,CONCATENATE(Matriz!A216,\" - P2 I2\"),\"\")","v":""},{"$f":"IF(CONCATENATE(C$12,O$3)=Matriz!$H$36,CONCATENATE(Matriz!A36,\" - P2 I3\"),\"\")","v":""},{"$f":"IF(CONCATENATE(C$12,O$3)=Matriz!$H$81,CONCATENATE(Matriz!A81,\" - P2 I3\"),\"\")","v":""},{"$f":"IF(CONCATENATE(C$12,O$3)=Matriz!$H$126,CONCATENATE(Matriz!A126,\" - P2 I3\"),\"\")","v":""},{"$f":"IF(CONCATENATE(C$12,O$3)=Matriz!$H$171,CONCATENATE(Matriz!A171,\" - P2 I3\"),\"\")","v":""},{"$f":"IF(CONCATENATE(C$12,O$3)=Matriz!$H$216,CONCATENATE(Matriz!A216,\" - P2 I3\"),\"\")","v":""},null,null,null,null,null,{"$f":"IF(CONCATENATE(C$12,Y$3)=Matriz!$H$36,CONCATENATE(Matriz!A36,\" - P2 I5\"),\"\")","v":""},{"$f":"IF(CONCATENATE(C$12,Y$3)=Matriz!$H$81,CONCATENATE(Matriz!A81,\" - P2 I5\"),\"\")","v":""},{"$f":"IF(CONCATENATE(C$12,Y$3)=Matriz!$H$126,CONCATENATE(Matriz!A126,\" - P2 I5\"),\"\")","v":""},{"$f":"IF(CONCATENATE(C$12,Y$3)=Matriz!$H$171,CONCATENATE(Matriz!A171,\" - P2 I5\"),\"\")","v":""},{"$f":"IF(CONCATENATE(C$12,Y$3)=Matriz!$H$216,CONCATENATE(Matriz!A216,\" - P2 I5\"),\"\")","v":""},null,null,null,null,null,9,9,{"$f":"AJ14*AI14","v":81}]
[null,null,null,null,{"$f":"IF(CONCATENATE(C$12,E$3)=Matriz!$H$45,CONCATENATE(Matriz!A45,\" - P2 I1\"),\"\")","v":""},{"$f":"IF(CONCATENATE(C$12,E$3)=Matriz!$H$90,CONCATENATE(Matriz!A90,\" - P2 I1\"),\"\")","v":""},{"$f":"IF(CONCATENATE(C$12,E$3)=Matriz!$H$135,CONCATENATE(Matriz!A135,\" - P2 I1\"),\"\")","v":""},{"$f":"IF(CONCATENATE(C$12,E$3)=Matriz!$H$180,CONCATENATE(Matriz!A180,\" - P2 I1\"),\"\")","v":""},{"$f":"IF(CONCATENATE(C$12,E$3)=Matriz!$H$225,CONCATENATE(Matriz!A225,\" - P2 I1\"),\"\")","v":""},{"$f":"IF(CONCATENATE(C$12,J$3)=Matriz!$H$45,CONCATENATE(Matriz!A45,\" - P2 I2\"),\"\")","v":""},{"$f":"IF(CONCATENATE(C$12,J$3)=Matriz!$H$90,CONCATENATE(Matriz!A90,\" - P2 I2\"),\"\")","v":""},{"$f":"IF(CONCATENATE(C$12,J$3)=Matriz!$H$135,CONCATENATE(Matriz!A135,\" - P2 I2\"),\"\")","v":""},{"$f":"IF(CONCATENATE(C$12,J$3)=Matriz!$H$180,CONCATENATE(Matriz!A180,\" - P2 I2\"),\"\")","v":""},{"$f":"IF(CONCATENATE(C$12,J$3)=Matriz!$H$225,CONCATENATE(Matriz!A225,\" - P2 I2\"),\"\")","v":""},{"$f":"IF(CONCATENATE(C$12,O$3)=Matriz!$H$45,CONCATENATE(Matriz!A45,\" - P2 I3\"),\"\")","v":""},{"$f":"IF(CONCATENATE(C$12,O$3)=Matriz!$H$90,CONCATENATE(Matriz!A90,\" - P2 I3\"),\"\")","v":""},{"$f":"IF(CONCATENATE(C$12,O$3)=Matriz!$H$135,CONCATENATE(Matriz!A135,\" - P2 I3\"),\"\")","v":""},{"$f":"IF(CONCATENATE(C$12,O$3)=Matriz!$H$180,CONCATENATE(Matriz!A180,\" - P2 I3\"),\"\")","v":""},{"$f":"IF(CONCATENATE(C$12,O$3)=Matriz!$H$225,CONCATENATE(Matriz!A225,\" - P2 I3\"),\"\")","v":""},{"$f":"IF(CONCATENATE(C$12,T$3)=Matriz!$H$36,CONCATENATE(Matriz!A36,\" - P2 I4\"),\"\")","v":""},{"$f":"IF(CONCATENATE(C$12,T$3)=Matriz!$H$72,CONCATENATE(Matriz!A72,\" - P2 I4\"),\"\")","v":""},null,null,{"$f":"IF(CONCATENATE(C$12,T$3)=Matriz!$H$225,CONCATENATE(Matriz!A225,\" - P2 I4\"),\"\")","v":""},{"$f":"IF(CONCATENATE(C$12,Y$3)=Matriz!$H$45,CONCATENATE(Matriz!A45,\" - P2 I5\"),\"\")","v":""},{"$f":"IF(CONCATENATE(C$12,Y$3)=Matriz!$H$90,CONCATENATE(Matriz!A90,\" - P2 I5\"),\"\")","v":""},{"$f":"IF(CONCATENATE(C$12,Y$3)=Matriz!$H$135,CONCATENATE(Matriz!A135,\" - P2 I5\"),\"\")","v":""},{"$f":"IF(CONCATENATE(C$12,Y$3)=Matriz!$H$180,CONCATENATE(Matriz!A180,\" - P2 I5\"),\"\")","v":""},{"$f":"IF(CONCATENATE(C$12,Y$3)=Matriz!$H$225,CONCATENATE(Matriz!A225,\" - P2 I5\"),\"\")","v":""},null,null,null,null,null,9,10,90]
[null,null,null,null,{"$f":"IF(CONCATENATE(C$17,E$3)=Matriz!$H$9,CONCATENATE(Matriz!A9,\" - P3 I1\"),\"\")","v":""},{"$f":"IF(CONCATENATE(C$17,E$3)=Matriz!$H$54,CONCATENATE(Matriz!A54,\" - P3 I1\"),\"\")","v":""},{"$f":"IF(CONCATENATE(C$17,E$3)=Matriz!$H$99,CONCATENATE(Matriz!A99,\" - P3 I1\"),\"\")","v":""},{"$f":"IF(CONCATENATE(C$17,E$3)=Matriz!$H$144,CONCATENATE(Matriz!A144,\" - P3 I1\"),\"\")","v":""},{"$f":"IF(CONCATENATE(C$17,E$3)=Matriz!$H$189,CONCATENATE(Matriz!A189,\" - P3 I1\"),\"\")","v":""},{"$f":"IF(CONCATENATE(C$17,J$3)=Matriz!$H$9,CONCATENATE(Matriz!A9,\" - P3 I2\"),\"\")","v":""},{"$f":"IF(CONCATENATE(C$17,J$3)=Matriz!$H$54,CONCATENATE(Matriz!A54,\" - P3 I2\"),\"\")","v":""},{"$f":"IF(CONCATENATE(C$17,J$3)=Matriz!$H$99,CONCATENATE(Matriz!A99,\" - P3 I2\"),\"\")","v":""},{"$f":"IF(CONCATENATE(C$17,J$3)=Matriz!$H$144,CONCATENATE(Matriz!A144,\" - P3 I2\"),\"\")","v":""},{"$f":"IF(CONCATENATE(C$17,J$3)=Matriz!$H$189,CONCATENATE(Matriz!A189,\" - P3 I2\"),\"\")","v":""},{"$f":"IF(CONCATENATE(C$17,O$3)=Matriz!$H$9,CONCATENATE(Matriz!A9,\" - P3 I3\"),\"\")","v":""},{"$f":"IF(CONCATENATE(C$17,O$3)=Matriz!$H$54,CONCATENATE(Matriz!A54,\" - P3 I3\"),\"\")","v":""},{"$f":"IF(CONCATENATE(C$17,O$3)=Matriz!$H$99,CONCATENATE(Matriz!A99,\" - P3 I3\"),\"\")","v":""},{"$f":"IF(CONCATENATE(C$17,O$3)=Matriz!$H$144,CONCATENATE(Matriz!A144,\" - P3 I3\"),\"\")","v":""},{"$f":"IF(CONCATENATE(C$17,O$3)=Matriz!$H$189,CONCATENATE(Matriz!A189,\" - P3 I3\"),\"\")","v":""},{"$f":"IF(CONCATENATE(C$17,T$3)=Matriz!$H$9,CONCATENATE(Matriz!A9,\" - P3 I4\"),\"\")","v":""},{"$f":"IF(CONCATENATE(C$17,T$3)=Matriz!$H$54,CONCATENATE(Matriz!A54,\" - P3 I4\"),\"\")","v":""},{"$f":"IF(CONCATENATE(C$17,T$3)=Matriz!$H$99,CONCATENATE(Matriz!A99,\" - P3 I4\"),\"\")","v":""},{"$f":"IF(CONCATENATE(C$17,T$3)=Matriz!$H$144,CONCATENATE(Matriz!A144,\" - P3 I4\"),\"\")","v":""},{"$f":"IF(CONCATENATE(C$17,T$3)=Matriz!$H$189,CONCATENATE(Matriz!A189,\" - P3 I4\"),\"\")","v":""},{"$f":"IF(CONCATENATE(C$17,Y$3)=Matriz!$H$9,CONCATENATE(Matriz!A9,\" - P3 I5\"),\"\")","v":""},{"$f":"IF(CONCATENATE(C$17,Y$3)=Matriz!$H$54,CONCATENATE(Matriz!A54,\" - P3 I5\"),\"\")","v":""},{"$f":"IF(CONCATENATE(C$17,Y$3)=Matriz!$H$99,CONCATENATE(Matriz!A99,\" - P3 I5\"),\"\")","v":""},{"$f":"IF(CONCATENATE(C$17,Y$3)=Matriz!$H$144,CONCATENATE(Matriz!A144,\" - P3 I5\"),\"\")","v":""},{"$f":"IF(CONCATENATE(C$17,Y$3)=Matriz!$H$189,CONCATENATE(Matriz!A189,\" - P3 I5\"),\"\")","v":""},null,null,null,null,null,9,11,99]
[null,null,3,"POSIBLE",{"$f":"IF(CONCATENATE(C$17,E$3)=Matriz!$H$18,CONCATENATE(Matriz!A18,\" - P3 I1\"),\"\")","v":""},{"$f":"IF(CONCATENATE(C$17,E$3)=Matriz!$H$63,CONCATENATE(Matriz!A63,\" - P3 I1\"),\"\")","v":""},{"$f":"IF(CONCATENATE(C$17,E$3)=Matriz!$H$108,CONCATENATE(Matriz!A108,\" - P3 I1\"),\"\")","v":""},{"$f":"IF(CONCATENATE(C$17,E$3)=Matriz!$H$153,CONCATENATE(Matriz!A153,\" - P3 I1\"),\"\")","v":""},{"$f":"IF(CONCATENATE(C$17,E$3)=Matriz!$H$198,CONCATENATE(Matriz!A198,\" - P3 I1\"),\"\")","v":""},{"$f":"IF(CONCATENATE(C$17,J$3)=Matriz!$H$18,CONCATENATE(Matriz!A18,\" - P3 I2\"),\"\")","v":""},{"$f":"IF(CONCATENATE(C$17,J$3)=Matriz!$H$63,CONCATENATE(Matriz!A63,\" - P3 I2\"),\"\")","v":""},{"$f":"IF(CONCATENATE(C$17,J$3)=Matriz!$H$108,CONCATENATE(Matriz!A108,\" - P3 I2\"),\"\")","v":""},{"$f":"IF(CONCATENATE(C$17,J$3)=Matriz!$H$153,CONCATENATE(Matriz!A153,\" - P3 I2\"),\"\")","v":""},{"$f":"IF(CONCATENATE(C$17,J$3)=Matriz!$H$198,CONCATENATE(Matriz!A198,\" - P3 I2\"),\"\")","v":""},{"$f":"IF(CONCATENATE(C$17,O$3)=Matriz!$H$18,CONCATENATE(Matriz!A18,\" - P3 I3\"),\"\")","v":""},{"$f":"IF(CONCATENATE(C$17,O$3)=Matriz!$H$63,CONCATENATE(Matriz!A63,\" - P3 I3\"),\"\")","v":""},{"$f":"IF(CONCATENATE(C$17,O$3)=Matriz!$H$108,CONCATENATE(Matriz!A108,\" - P3 I3\"),\"\")","v":""},{"$f":"IF(CONCATENATE(C$17,O$3)=Matriz!$H$153,CONCATENATE(Matriz!A153,\" - P3 I3\"),\"\")","v":""},{"$f":"IF(CONCATENATE(C$17,O$3)=Matriz!$H$198,CONCATENATE(Matriz!A198,\" - P3 I3\"),\"\")","v":""},{"$f":"IF(CONCATENATE(C$17,T$3)=Matriz!$H$18,CONCATENATE(Matriz!A18,\" - P3 I4\"),\"\")","v":""},{"$f":"IF(CONCATENATE(C$17,T$3)=Matriz!$H$63,CONCATENATE(Matriz!A63,\" - P3 I4\"),\"\")","v":""},{"$f":"IF(CONCATENATE(C$17,T$3)=Matriz!$H$108,CONCATENATE(Matriz!A108,\" - P3 I4\"),\"\")","v":""},{"$f":"IF(CONCATENATE(C$17,T$3)=Matriz!$H$153,CONCATENATE(Matriz!A153,\" - P3 I4\"),\"\")","v":""},{"$f":"IF(CONCATENATE(C$17,T$3)=Matriz!$H$198,CONCATENATE(Matriz!A198,\" - P3 I4\"),\"\")","v":""},{"$f":"IF(CONCATENATE(C$17,Y$3)=Matriz!$H$18,CONCATENATE(Matriz!A18,\" - P3 I5\"),\"\")","v":""},{"$f":"IF(CONCATENATE(C$17,Y$3)=Matriz!$H$63,CONCATENATE(Matriz!A63,\" - P3 I5\"),\"\")","v":""},{"$f":"IF(CONCATENATE(C$17,Y$3)=Matriz!$H$108,CONCATENATE(Matriz!A108,\" - P3 I5\"),\"\")","v":""},{"$f":"IF(CONCATENATE(C$17,Y$3)=Matriz!$H$153,CONCATENATE(Matriz!A153,\" - P3 I5\"),\"\")","v":""},{"$f":"IF(CONCATENATE(C$17,Y$3)=Matriz!$H$198,CONCATENATE(Matriz!A198,\" - P3 I5\"),\"\")","v":""},null,null,null,null,null,9,12,108]
[null,null,null,null,{"$f":"IF(CONCATENATE(C$17,E$3)=Matriz!$H$27,CONCATENATE(Matriz!A27,\" - P3 I1\"),\"\")","v":""},{"$f":"IF(CONCATENATE(C$17,E$3)=Matriz!$H$72,CONCATENATE(Matriz!A72,\" - P3 I1\"),\"\")","v":""},{"$f":"IF(CONCATENATE(C$17,E$3)=Matriz!$H$117,CONCATENATE(Matriz!A117,\" - P3 I1\"),\"\")","v":""},{"$f":"IF(CONCATENATE(C$17,E$3)=Matriz!$H$162,CONCATENATE(Matriz!A162,\" - P3 I1\"),\"\")","v":""},{"$f":"IF(CONCATENATE(C$17,E$3)=Matriz!$H$207,CONCATENATE(Matriz!A207,\" - P3 I1\"),\"\")","v":""},{"$f":"IF(CONCATENATE(C$17,J$3)=Matriz!$H$27,CONCATENATE(Matriz!A27,\" - P3 I2\"),\"\")","v":""},{"$f":"IF(CONCATENATE(C$17,J$3)=Matriz!$H$72,CONCATENATE(Matriz!A72,\" - P3 I2\"),\"\")","v":""},{"$f":"IF(CONCATENATE(C$17,J$3)=Matriz!$H$117,CONCATENATE(Matriz!A117,\" - P3 I2\"),\"\")","v":""},{"$f":"IF(CONCATENATE(C$17,J$3)=Matriz!$H$162,CONCATENATE(Matriz!A162,\" - P3 I2\"),\"\")","v":""},{"$f":"IF(CONCATENATE(C$17,J$3)=Matriz!$H$207,CONCATENATE(Matriz!A207,\" - P3 I2\"),\"\")","v":""},{"$f":"IF(CONCATENATE(C$17,O$3)=Matriz!$H$27,CONCATENATE(Matriz!A27,\" - P3 I3\"),\"\")","v":""},{"$f":"IF(CONCATENATE(C$17,O$3)=Matriz!$H$72,CONCATENATE(Matriz!A72,\" - P3 I3\"),\"\")","v":""},{"$f":"IF(CONCATENATE(C$17,O$3)=Matriz!$H$117,CONCATENATE(Matriz!A117,\" - P3 I3\"),\"\")","v":""},{"$f":"IF(CONCATENATE(C$17,O$3)=Matriz!$H$162,CONCATENATE(Matriz!A162,\" - P3 I3\"),\"\")","v":""},{"$f":"IF(CONCATENATE(C$17,O$3)=Matriz!$H$207,CONCATENATE(Matriz!A207,\" - P3 I3\"),\"\")","v":""},{"$f":"IF(CONCATENATE(C$17,T$3)=Matriz!$H$27,CONCATENATE(Matriz!A27,\" - P3 I4\"),\"\")","v":""},{"$f":"IF(CONCATENATE(C$17,T$3)=Matriz!$H$72,CONCATENATE(Matriz!A72,\" - P3 I4\"),\"\")","v":""},{"$f":"IF(CONCATENATE(C$17,T$3)=Matriz!$H$117,CONCATENATE(Matriz!A117,\" - P3 I4\"),\"\")","v":""},{"$f":"IF(CONCATENATE(C$17,T$3)=Matriz!$H$162,CONCATENATE(Matriz!A162,\" - P3 I4\"),\"\")","v":""},{"$f":"IF(CONCATENATE(C$17,T$3)=Matriz!$H$207,CONCATENATE(Matriz!A207,\" - P3 I4\"),\"\")","v":""},{"$f":"IF(CONCATENATE(C$17,Y$3)=Matriz!$H$27,CONCATENATE(Matriz!A27,\" - P3 I5\"),\"\")","v":""},{"$f":"IF(CONCATENATE(C$17,Y$3)=Matriz!$H$72,CONCATENATE(Matriz!A72,\" - P3 I5\"),\"\")","v":""},{"$f":"IF(CONCATENATE(C$17,Y$3)=Matriz!$H$117,CONCATENATE(Matriz!A117,\" - P3 I5\"),\"\")","v":""},{"$f":"IF(CONCATENATE(C$17,Y$3)=Matriz!$H$162,CONCATENATE(Matriz!A162,\" - P3 I5\"),\"\")","v":""},{"$f":"IF(CONCATENATE(C$17,Y$3)=Matriz!$H$207,CONCATENATE(Matriz!A207,\" - P3 I5\"),\"\")","v":""},null,null,null,null,null,9,13,117]
[null,null,null,null,{"$f":"IF(CONCATENATE(C$17,E$3)=Matriz!$H$36,CONCATENATE(Matriz!A36,\" - P3 I1\"),\"\")","v":""},{"$f":"IF(CONCATENATE(C$17,E$3)=Matriz!$H$81,CONCATENATE(Matriz!A81,\" - P3 I1\"),\"\")","v":""},{"$f":"IF(CONCATENATE(C$17,E$3)=Matriz!$H$126,CONCATENATE(Matriz!A126,\" - P3 I1\"),\"\")","v":""},{"$f":"IF(CONCATENATE(C$17,E$3)=Matriz!$H$171,CONCATENATE(Matriz!A171,\" - P3 I1\"),\"\")","v":""},{"$f":"IF(CONCATENATE(C$17,E$3)=Matriz!$H$216,CONCATENATE(Matriz!A216,\" - P3 I1\"),\"\")","v":""},{"$f":"IF(CONCATENATE(C$17,J$3)=Matriz!$H$36,CONCATENATE(Matriz!A36,\" - P3 I2\"),\"\")","v":""},{"$f":"IF(CONCATENATE(C$17,J$3)=Matriz!$H$81,CONCATENATE(Matriz!A81,\" - P3 I2\"),\"\")","v":""},{"$f":"IF(CONCATENATE(C$17,J$3)=Matriz!$H$126,CONCATENATE(Matriz!A126,\" - P3 I2\"),\"\")","v":""},{"$f":"IF(CONCATENATE(C$17,J$3)=Matriz!$H$171,CONCATENATE(Matriz!A171,\" - P3 I2\"),\"\")","v":""},{"$f":"IF(CONCATENATE(C$17,J$3)=Matriz!$H$216,CONCATENATE(Matriz!A216,\" - P3 I2\"),\"\")","v":""},{"$f":"IF(CONCATENATE(C$17,O$3)=Matriz!$H$36,CONCATENATE(Matriz!A36,\" - P3 I3\"),\"\")","v":""},{"$f":"IF(CONCATENATE(C$17,O$3)=Matriz!$H$81,CONCATENATE(Matriz!A81,\" - P3 I3\"),\"\")","v":""},{"$f":"IF(CONCATENATE(C$17,O$3)=Matriz!$H$126,CONCATENATE(Matriz!A126,\" - P3 I3\"),\"\")","v":""},{"$f":"IF(CONCATENATE(C$17,O$3)=Matriz!$H$171,CONCATENATE(Matriz!A171,\" - P3 I3\"),\"\")","v":""},{"$f":"IF(CONCATENATE(C$17,O$3)=Matriz!$H$216,CONCATENATE(Matriz!A216,\" - P3 I3\"),\"\")","v":""},{"$f":"IF(CONCATENATE(C$17,T$3)=Matriz!$H$36,CONCATENATE(Matriz!A36,\" - P3 I4\"),\"\")","v":""},{"$f":"IF(CONCATENATE(C$17,T$3)=Matriz!$H$81,CONCATENATE(Matriz!A81,\" - P3 I4\"),\"\")","v":""},{"$f":"IF(CONCATENATE(C$17,T$3)=Matriz!$H$126,CONCATENATE(Matriz!A126,\" - P3 I4\"),\"\")","v":""},{"$f":"IF(CONCATENATE(C$17,T$3)=Matriz!$H$171,CONCATENATE(Matriz!A171,\" - P3 I4\"),\"\")","v":""},{"$f":"IF(CONCATENATE(C$17,T$3)=Matriz!$H$216,CONCATENATE(Matriz!A216,\" - P3 I4\"),\"\")","v":""},{"$f":"IF(CONCATENATE(C$17,Y$3)=Matriz!$H$36,CONCATENATE(Matriz!A36,\" - P3 I5\"),\"\")","v":""},{"$f":"IF(CONCATENATE(C$17,Y$3)=Matriz!$H$81,CONCATENATE(Matriz!A81,\" - P3 I5\"),\"\")","v":""},{"$f":"IF(CONCATENATE(C$17,Y$3)=Matriz!$H$126,CONCATENATE(Matriz!A126,\" - P3 I5\"),\"\")","v":""},{"$f":"IF(CONCATENATE(C$17,Y$3)=Matriz!$H$171,CONCATENATE(Matriz!A171,\" - P3 I5\"),\"\")","v":""},{"$f":"IF(CONCATENATE(C$17,Y$3)=Matriz!$H$216,CONCATENATE(Matriz!A216,\" - P3 I5\"),\"\")","v":""},null,null,null,null,null,9,14,126]
[null,null,null,null,{"$f":"IF(CONCATENATE(C$17,E$3)=Matriz!$H$45,CONCATENATE(Matriz!A45,\" - P3 I1\"),\"\")","v":""},{"$f":"IF(CONCATENATE(C$17,E$3)=Matriz!$H$90,CONCATENATE(Matriz!A90,\" - P3 I1\"),\"\")","v":""},{"$f":"IF(CONCATENATE(C$17,E$3)=Matriz!$H$135,CONCATENATE(Matriz!A135,\" - P3 I1\"),\"\")","v":""},{"$f":"IF(CONCATENATE(C$17,E$3)=Matriz!$H$180,CONCATENATE(Matriz!A180,\" - P3 I1\"),\"\")","v":""},{"$f":"IF(CONCATENATE(C$17,E$3)=Matriz!$H$225,CONCATENATE(Matriz!A225,\" - P3 I1\"),\"\")","v":""},{"$f":"IF(CONCATENATE(C$17,J$3)=Matriz!$H$45,CONCATENATE(Matriz!A45,\" - P3 I2\"),\"\")","v":""},{"$f":"IF(CONCATENATE(C$17,J$3)=Matriz!$H$90,CONCATENATE(Matriz!A90,\" - P3 I2\"),\"\")","v":""},{"$f":"IF(CONCATENATE(C$17,J$3)=Matriz!$H$135,CONCATENATE(Matriz!A135,\" - P3 I2\"),\"\")","v":""},{"$f":"IF(CONCATENATE(C$17,J$3)=Matriz!$H$180,CONCATENATE(Matriz!A180,\" - P3 I2\"),\"\")","v":""},{"$f":"IF(CONCATENATE(C$17,J$3)=Matriz!$H$225,CONCATENATE(Matriz!A225,\" - P3 I2\"),\"\")","v":""},{"$f":"IF(CONCATENATE(C$17,O$3)=Matriz!$H$45,CONCATENATE(Matriz!A45,\" - P3 I3\"),\"\")","v":""},{"$f":"IF(CONCATENATE(C$17,O$3)=Matriz!$H$90,CONCATENATE(Matriz!A90,\" - P3 I3\"),\"\")","v":""},{"$f":"IF(CONCATENATE(C$17,O$3)=Matriz!$H$135,CONCATENATE(Matriz!A135,\" - P3 I3\"),\"\")","v":""},{"$f":"IF(CONCATENATE(C$17,O$3)=Matriz!$H$180,CONCATENATE(Matriz!A180,\" - P3 I3\"),\"\")","v":""},{"$f":"IF(CONCATENATE(C$17,O$3)=Matriz!$H$225,CONCATENATE(Matriz!A225,\" - P3 I3\"),\"\")","v":""},{"$f":"IF(CONCATENATE(C$17,T$3)=Matriz!$H$45,CONCATENATE(Matriz!A45,\" - P3 I4\"),\"\")","v":""},{"$f":"IF(CONCATENATE(C$17,T$3)=Matriz!$H$90,CONCATENATE(Matriz!A90,\" - P3 I4\"),\"\")","v":""},{"$f":"IF(CONCATENATE(C$17,T$3)=Matriz!$H$135,CONCATENATE(Matriz!A135,\" - P3 I4\"),\"\")","v":""},{"$f":"IF(CONCATENATE(C$17,T$3)=Matriz!$H$180,CONCATENATE(Matriz!A180,\" - P3 I4\"),\"\")","v":""},{"$f":"IF(CONCATENATE(C$17,T$3)=Matriz!$H$225,CONCATENATE(Matriz!A225,\" - P3 I4\"),\"\")","v":""},{"$f":"IF(CONCATENATE(C$17,Y$3)=Matriz!$H$45,CONCATENATE(Matriz!A45,\" - P3 I5\"),\"\")","v":""},{"$f":"IF(CONCATENATE(C$17,Y$3)=Matriz!$H$90,CONCATENATE(Matriz!A90,\" - P3 I5\"),\"\")","v":""},{"$f":"IF(CONCATENATE(C$17,Y$3)=Matriz!$H$135,CONCATENATE(Matriz!A135,\" - P3 I5\"),\"\")","v":""},{"$f":"IF(CONCATENATE(C$17,Y$3)=Matriz!$H$180,CONCATENATE(Matriz!A180,\" - P3 I5\"),\"\")","v":""},{"$f":"IF(CONCATENATE(C$17,Y$3)=Matriz!$H$225,CONCATENATE(Matriz!A225,\" - P3 I5\"),\"\")","v":""},null,null,null,null,null,9,15,135]
[null,null,null,null,{"$f":"IF(CONCATENATE(C$22,E$3)=Matriz!$H$9,CONCATENATE(Matriz!A9,\" - P4 I1\"),\"\")","v":""},{"$f":"IF(CONCATENATE(C$22,E$3)=Matriz!$H$54,CONCATENATE(Matriz!A54,\" - P4 I1\"),\"\")","v":""},{"$f":"IF(CONCATENATE(C$22,E$3)=Matriz!$H$99,CONCATENATE(Matriz!A99,\" - P4 I1\"),\"\")","v":""},{"$f":"IF(CONCATENATE(C$22,E$3)=Matriz!$H$144,CONCATENATE(Matriz!A144,\" - P4 I1\"),\"\")","v":""},{"$f":"IF(CONCATENATE(C$22,E$3)=Matriz!$H$189,CONCATENATE(Matriz!A189,\" - P4 I1\"),\"\")","v":""},{"$f":"IF(CONCATENATE(C$22,J$3)=Matriz!$H$9,CONCATENATE(Matriz!A9,\" - P4 I2\"),\"\")","v":""},{"$f":"IF(CONCATENATE(C$22,J$3)=Matriz!$H$54,CONCATENATE(Matriz!A54,\" - P4 I2\"),\"\")","v":""},{"$f":"IF(CONCATENATE(C$22,J$3)=Matriz!$H$99,CONCATENATE(Matriz!A99,\" - P4 I2\"),\"\")","v":""},{"$f":"IF(CONCATENATE(C$22,J$3)=Matriz!$H$144,CONCATENATE(Matriz!A144,\" - P4 I2\"),\"\")","v":""},{"$f":"IF(CONCATENATE(C$22,J$3)=Matriz!$H$189,CONCATENATE(Matriz!A189,\" - P4 I2\"),\"\")","v":""},{"$f":"IF(CONCATENATE(C$22,O$3)=Matriz!$H$9,CONCATENATE(Matriz!A9,\" - P4 I3\"),\"\")","v":""},{"$f":"IF(CONCATENATE(C$22,O$3)=Matriz!$H$54,CONCATENATE(Matriz!A54,\" - P4 I3\"),\"\")","v":""},{"$f":"IF(CONCATENATE(C$22,O$3)=Matriz!$H$99,CONCATENATE(Matriz!A99,\" - P4 I3\"),\"\")","v":"R11\nGESTIÓN ADMINISTRATIVA Y FINANCIERA\n TESORERÍA - P4 I3"},{"$f":"IF(CONCATENATE(C$22,O$3)=Matriz!$H$144,CONCATENATE(Matriz!A144,\" - P4 I3\"),\"\")","v":""},{"$f":"IF(CONCATENATE(C$22,O$3)=Matriz!$H$189,CONCATENATE(Matriz!A189,\" - P4 I3\"),\"\")","v":""},{"$f":"IF(CONCATENATE(C$22,T$3)=Matriz!$H$9,CONCATENATE(Matriz!A9,\" - P4 I4\"),\"\")","v":"R1\nDIRECCIÓN ESTRATÉGICA - P4 I4"},{"$f":"IF(CONCATENATE(C$22,T$3)=Matriz!$H$54,CONCATENATE(Matriz!A54,\" - P4 I4\"),\"\")","v":""},{"$f":"IF(CONCATENATE(C$22,T$3)=Matriz!$H$99,CONCATENATE(Matriz!A99,\" - P4 I4\"),\"\")","v":""},{"$f":"IF(CONCATENATE(C$22,T$3)=Matriz!$H$144,CONCATENATE(Matriz!A144,\" - P4 I4\"),\"\")","v":""},{"$f":"IF(CONCATENATE(C$22,T$3)=Matriz!$H$189,CONCATENATE(Matriz!A189,\" - P4 I4\"),\"\")","v":""},{"$f":"IF(CONCATENATE(C$22,Y$3)=Matriz!$H$9,CONCATENATE(Matriz!A9,\" - P4 I5\"),\"\")","v":""},{"$f":"IF(CONCATENATE(C$22,Y$3)=Matriz!$H$54,CONCATENATE(Matriz!A54,\" - P4 I5\"),\"\")","v":"R6\nGESTIÓN ADMINISTRATIVA Y FINANCIERA \nCONTABILIDAD - P4 I5"},{"$f":"IF(CONCATENATE(C$22,Y$3)=Matriz!$H$99,CONCATENATE(Matriz!A99,\" - P4 I5\"),\"\")","v":""},{"$f":"IF(CONCATENATE(C$22,Y$3)=Matriz!$H$144,CONCATENATE(Matriz!A144,\" - P4 I5\"),\"\")","v":""},{"$f":"IF(CONCATENATE(C$22,Y$3)=Matriz!$H$189,CONCATENATE(Matriz!A189,\" - P4 I5\"),\"\")","v":""},null,null,null,null,null,9,16,144]
[null,null,2,"IMPROBABLE",{"$f":"IF(CONCATENATE(C$22,E$3)=Matriz!$H$18,CONCATENATE(Matriz!A18,\" - P4 I1\"),\"\")","v":""},{"$f":"IF(CONCATENATE(C$22,E$3)=Matriz!$H$63,CONCATENATE(Matriz!A63,\" - P4 I1\"),\"\")","v":""},{"$f":"IF(CONCATENATE(C$22,E$3)=Matriz!$H$108,CONCATENATE(Matriz!A108,\" - P4 I1\"),\"\")","v":""},{"$f":"IF(CONCATENATE(C$22,E$3)=Matriz!$H$153,CONCATENATE(Matriz!A153,\" - P4 I1\"),\"\")","v":""},{"$f":"IF(CONCATENATE(C$22,E$3)=Matriz!$H$198,CONCATENATE(Matriz!A198,\" - P4 I1\"),\"\")","v":""},{"$f":"IF(CONCATENATE(C$22,J$3)=Matriz!$H$18,CONCATENATE(Matriz!A18,\" - P4 I2\"),\"\")","v":""},{"$f":"IF(CONCATENATE(C$22,J$3)=Matriz!$H$63,CONCATENATE(Matriz!A63,\" - P4 I2\"),\"\")","v":""},{"$f":"IF(CONCATENATE(C$22,J$3)=Matriz!$H$108,CONCATENATE(Matriz!A108,\" - P4 I2\"),\"\")","v":""},{"$f":"IF(CONCATENATE(C$22,J$3)=Matriz!$H$153,CONCATENATE(Matriz!A153,\" - P4 I2\"),\"\")","v":""},{"$f":"IF(CONCATENATE(C$22,J$3)=Matriz!$H$198,CONCATENATE(Matriz!A198,\" - P4 I2\"),\"\")","v":""},{"$f":"IF(CONCATENATE(C$22,O$3)=Matriz!$H$18,CONCATENATE(Matriz!A18,\" - P4 I3\"),\"\")","v":""},{"$f":"IF(CONCATENATE(C$22,O$3)=Matriz!$H$63,CONCATENATE(Matriz!A63,\" - P4 I3\"),\"\")","v":""},{"$f":"IF(CONCATENATE(C$22,O$3)=Matriz!$H$108,CONCATENATE(Matriz!A108,\" - P4 I3\"),\"\")","v":""},{"$f":"IF(CONCATENATE(C$22,O$3)=Matriz!$H$153,CONCATENATE(Matriz!A153,\" - P4 I3\"),\"\")","v":""},{"$f":"IF(CONCATENATE(C$22,O$3)=Matriz!$H$198,CONCATENATE(Matriz!A198,\" - P4 I3\"),\"\")","v":""},{"$f":"IF(CONCATENATE(C$22,T$3)=Matriz!$H$18,CONCATENATE(Matriz!A18,\" - P4 I4\"),\"\")","v":"R2\nDIRECCIÓN ESTRATÉGICA - P4 I4"},{"$f":"IF(CONCATENATE(C$22,T$3)=Matriz!$H$63,CONCATENATE(Matriz!A63,\" - P4 I4\"),\"\")","v":""},{"$f":"IF(CONCATENATE(C$22,T$3)=Matriz!$H$108,CONCATENATE(Matriz!A108,\" - P4 I4\"),\"\")","v":"R12\nGESTIÓN JURÍDICA - P4 I4"},{"$f":"IF(CONCATENATE(C$22,T$3)=Matriz!$H$153,CONCATENATE(Matriz!A153,\" - P4 I4\"),\"\")","v":""},{"$f":"IF(CONCATENATE(C$22,T$3)=Matriz!$H$198,CONCATENATE(Matriz!A198,\" - P4 I4\"),\"\")","v":""},{"$f":"IF(CONCATENATE(C$22,Y$3)=Matriz!$H$18,CONCATENATE(Matriz!A18,\" - P4 I5\"),\"\")","v":""},{"$f":"IF(CONCATENATE(C$22,Y$3)=Matriz!$H$63,CONCATENATE(Matriz!A63,\" - P4 I5\"),\"\")","v":"R7\nGESTIÓN ADMINISTRATIVA Y FINANCIERA \nALMACÈN - P4 I5"},{"$f":"IF(CONCATENATE(C$22,Y$3)=Matriz!$H$108,CONCATENATE(Matriz!A108,\" - P4 I5\"),\"\")","v":""},{"$f":"IF(CONCATENATE(C$22,Y$3)=Matriz!$H$153,CONCATENATE(Matriz!A153,\" - P4 I5\"),\"\")","v":""},{"$f":"IF(CONCATENATE(C$22,Y$3)=Matriz!$H$198,CONCATENATE(Matriz!A198,\" - P4 I5\"),\"\")","v":""},null,null,null,null,null,9,17,153]
[null,null,null,null,{"$f":"IF(CONCATENATE(C$22,E$3)=Matriz!$H$27,CONCATENATE(Matriz!A27,\" - P4 I1\"),\"\")","v":""},{"$f":"IF(CONCATENATE(C$22,E$3)=Matriz!$H$72,CONCATENATE(Matriz!A72,\" - P4 I1\"),\"\")","v":""},{"$f":"IF(CONCATENATE(C$22,E$3)=Matriz!$H$117,CONCATENATE(Matriz!A117,\" - P4 I1\"),\"\")","v":""},{"$f":"IF(CONCATENATE(C$22,E$3)=Matriz!$H$162,CONCATENATE(Matriz!A162,\" - P4 I1\"),\"\")","v":""},{"$f":"IF(CONCATENATE(C$22,E$3)=Matriz!$H$207,CONCATENATE(Matriz!A207,\" - P4 I1\"),\"\")","v":""},{"$f":"IF(CONCATENATE(C$22,J$3)=Matriz!$H$27,CONCATENATE(Matriz!A27,\" - P4 I2\"),\"\")","v":""},{"$f":"IF(CONCATENATE(C$22,J$3)=Matriz!$H$72,CONCATENATE(Matriz!A72,\" - P4 I2\"),\"\")","v":""},{"$f":"IF(CONCATENATE(C$22,J$3)=Matriz!$H$117,CONCATENATE(Matriz!A117,\" - P4 I2\"),\"\")","v":""},{"$f":"IF(CONCATENATE(C$22,J$3)=Matriz!$H$162,CONCATENATE(Matriz!A162,\" - P4 I2\"),\"\")","v":""},{"$f":"IF(CONCATENATE(C$22,J$3)=Matriz!$H$207,CONCATENATE(Matriz!A207,\" - P4 I2\"),\"\")","v":""},{"$f":"IF(CONCATENATE(C$22,O$3)=Matriz!$H$27,CONCATENATE(Matriz!A27,\" - P4 I3\"),\"\")","v":""},{"$f":"IF(CONCATENATE(C$22,O$3)=Matriz!$H$72,CONCATENATE(Matriz!A72,\" - P4 I3\"),\"\")","v":""},{"$f":"IF(CONCATENATE(C$22,O$3)=Matriz!$H$117,CONCATENATE(Matriz!A117,\" - P4 I3\"),\"\")","v":""},{"$f":"IF(CONCATENATE(C$22,O$3)=Matriz!$H$162,CONCATENATE(Matriz!A162,\" - P4 I3\"),\"\")","v":""},{"$f":"IF(CONCATENATE(C$22,O$3)=Matriz!$H$207,CONCATENATE(Matriz!A207,\" - P4 I3\"),\"\")","v":""},{"$f":"IF(CONCATENATE(C$22,T$3)=Matriz!$H$27,CONCATENATE(Matriz!A27,\" - P4 I4\"),\"\")","v":"R3\nPLANEACIÓN INSTITUCIONAL\n - P4 I4"},{"$f":"IF(CONCATENATE(C$22,T$3)=Matriz!$H$72,CONCATENATE(Matriz!A72,\" - P4 I4\"),\"\")","v":""},{"$f":"IF(CONCATENATE(C$22,T$3)=Matriz!$H$117,CONCATENATE(Matriz!A117,\" - P4 I4\"),\"\")","v":"R13\nGESTIÓN JURÍDICA - P4 I4"},{"$f":"IF(CONCATENATE(C$22,T$3)=Matriz!$H$162,CONCATENATE(Matriz!A162,\" - P4 I4\"),\"\")","v":""},{"$f":"IF(CONCATENATE(C$22,T$3)=Matriz!$H$207,CONCATENATE(Matriz!A207,\" - P4 I4\"),\"\")","v":""},{"$f":"IF(CONCATENATE(C$22,Y$3)=Matriz!$H$27,CONCATENATE(Matriz!A27,\" - P4 I5\"),\"\")","v":""},{"$f":"IF(CONCATENATE(C$22,Y$3)=Matriz!$H$72,CONCATENATE(Matriz!A72,\" - P4 I5\"),\"\")","v":"R8\nGESTIÓN ADMINISTRATIVA Y FINANCIERA\n GESTIÓN  DOCUMENTAL - P4 I5"},{"$f":"IF(CONCATENATE(C$22,Y$3)=Matriz!$H$117,CONCATENATE(Matriz!A117,\" - P4 I5\"),\"\")","v":""},{"$f":"IF(CONCATENATE(C$22,Y$3)=Matriz!$H$162,CONCATENATE(Matriz!A162,\" - P4 I5\"),\"\")","v":""},{"$f":"IF(CONCATENATE(C$22,Y$3)=Matriz!$H$207,CONCATENATE(Matriz!A207,\" - P4 I5\"),\"\")","v":""},null,null,null,null,null,9,18,162]
[null,null,null,null,{"$f":"IF(CONCATENATE(C$22,E$3)=Matriz!$H$36,CONCATENATE(Matriz!A36,\" - P4 I1\"),\"\")","v":""},{"$f":"IF(CONCATENATE(C$22,E$3)=Matriz!$H$81,CONCATENATE(Matriz!A81,\" - P4 I1\"),\"\")","v":""},{"$f":"IF(CONCATENATE(C$22,E$3)=Matriz!$H$126,CONCATENATE(Matriz!A126,\" - P4 I1\"),\"\")","v":""},{"$f":"IF(CONCATENATE(C$22,E$3)=Matriz!$H$171,CONCATENATE(Matriz!A171,\" - P4 I1\"),\"\")","v":""},{"$f":"IF(CONCATENATE(C$22,E$3)=Matriz!$H$216,CONCATENATE(Matriz!A216,\" - P4 I1\"),\"\")","v":""},{"$f":"IF(CONCATENATE(C$22,J$3)=Matriz!$H$36,CONCATENATE(Matriz!A36,\" - P4 I2\"),\"\")","v":""},{"$f":"IF(CONCATENATE(C$22,J$3)=Matriz!$H$81,CONCATENATE(Matriz!A81,\" - P4 I2\"),\"\")","v":""},{"$f":"IF(CONCATENATE(C$22,J$3)=Matriz!$H$126,CONCATENATE(Matriz!A126,\" - P4 I2\"),\"\")","v":""},{"$f":"IF(CONCATENATE(C$22,J$3)=Matriz!$H$171,CONCATENATE(Matriz!A171,\" - P4 I2\"),\"\")","v":""},{"$f":"IF(CONCATENATE(C$22,J$3)=Matriz!$H$216,CONCATENATE(Matriz!A216,\" - P4 I2\"),\"\")","v":""},{"$f":"IF(CONCATENATE(C$22,O$3)=Matriz!$H$36,CONCATENATE(Matriz!A36,\" - P4 I3\"),\"\")","v":""},{"$f":"IF(CONCATENATE(C$22,O$3)=Matriz!$H$81,CONCATENATE(Matriz!A81,\" - P4 I3\"),\"\")","v":""},{"$f":"IF(CONCATENATE(C$22,O$3)=Matriz!$H$126,CONCATENATE(Matriz!A126,\" - P4 I3\"),\"\")","v":""},{"$f":"IF(CONCATENATE(C$22,O$3)=Matriz!$H$171,CONCATENATE(Matriz!A171,\" - P4 I3\"),\"\")","v":""},{"$f":"IF(CONCATENATE(C$22,O$3)=Matriz!$H$216,CONCATENATE(Matriz!A216,\" - P4 I3\"),\"\")","v":""},{"$f":"IF(CONCATENATE(C$22,T$3)=Matriz!$H$36,CONCATENATE(Matriz!A36,\" - P4 I4\"),\"\")","v":"R4\nGESTIÓN TÉCNICA\n - P4 I4"},{"$f":"IF(CONCATENATE(C$22,T$3)=Matriz!$H$81,CONCATENATE(Matriz!A81,\" - P4 I4\"),\"\")","v":"R9\nGESTIÓN ADMINISTRATIVA Y FINANCIERA\n TALENTO HUMANO - P4 I4"},{"$f":"IF(CONCATENATE(C$22,T$3)=Matriz!$H$126,CONCATENATE(Matriz!A126,\" - P4 I4\"),\"\")","v":""},{"$f":"IF(CONCATENATE(C$22,T$3)=Matriz!$H$171,CONCATENATE(Matriz!A171,\" - P4 I4\"),\"\")","v":""},{"$f":"IF(CONCATENATE(C$22,T$3)=Matriz!$H$216,CONCATENATE(Matriz!A216,\" - P4 I4\"),\"\")","v":""},{"$f":"IF(CONCATENATE(C$22,Y$3)=Matriz!$H$36,CONCATENATE(Matriz!A36,\" - P4 I5\"),\"\")","v":""},{"$f":"IF(CONCATENATE(C$22,Y$3)=Matriz!$H$81,CONCATENATE(Matriz!A81,\" - P4 I5\"),\"\")","v":""},{"$f":"IF(CONCATENATE(C$22,Y$3)=Matriz!$H$126,CONCATENATE(Matriz!A126,\" - P4 I5\"),\"\")","v":""},{"$f":"IF(CONCATENATE(C$22,Y$3)=Matriz!$H$171,CONCATENATE(Matriz!A171,\" - P4 I5\"),\"\")","v":""},{"$f":"IF(CONCATENATE(C$22,Y$3)=Matriz!$H$216,CONCATENATE(Matriz!A216,\" - P4 I5\"),\"\")","v":""},null,null,null,null,null,9,19,171]
[null,null,null,null,{"$f":"IF(CONCATENATE(C$22,E$3)=Matriz!$H$45,CONCATENATE(Matriz!A45,\" - P4 I1\"),\"\")","v":""},{"$f":"IF(CONCATENATE(C$22,E$3)=Matriz!$H$90,CONCATENATE(Matriz!A90,\" - P4 I1\"),\"\")","v":""},{"$f":"IF(CONCATENATE(C$22,E$3)=Matriz!$H$135,CONCATENATE(Matriz!A135,\" - P4 I1\"),\"\")","v":""},{"$f":"IF(CONCATENATE(C$22,E$3)=Matriz!$H$180,CONCATENATE(Matriz!A180,\" - P4 I1\"),\"\")","v":""},{"$f":"IF(CONCATENATE(C$22,E$3)=Matriz!$H$225,CONCATENATE(Matriz!A225,\" - P4 I1\"),\"\")","v":""},{"$f":"IF(CONCATENATE(C$22,J$3)=Matriz!$H$45,CONCATENATE(Matriz!A45,\" - P4 I2\"),\"\")","v":""},{"$f":"IF(CONCATENATE(C$22,J$3)=Matriz!$H$90,CONCATENATE(Matriz!A90,\" - P4 I2\"),\"\")","v":""},{"$f":"IF(CONCATENATE(C$22,J$3)=Matriz!$H$135,CONCATENATE(Matriz!A135,\" - P4 I2\"),\"\")","v":""},{"$f":"IF(CONCATENATE(C$22,J$3)=Matriz!$H$180,CONCATENATE(Matriz!A180,\" - P4 I2\"),\"\")","v":""},{"$f":"IF(CONCATENATE(C$22,J$3)=Matriz!$H$225,CONCATENATE(Matriz!A225,\" - P4 I2\"),\"\")","v":""},{"$f":"IF(CONCATENATE(C$22,O$3)=Matriz!$H$45,CONCATENATE(Matriz!A45,\" - P4 I3\"),\"\")","v":""},{"$f":"IF(CONCATENATE(C$22,O$3)=Matriz!$H$90,CONCATENATE(Matriz!A90,\" - P4 I3\"),\"\")","v":""},{"$f":"IF(CONCATENATE(C$22,O$3)=Matriz!$H$135,CONCATENATE(Matriz!A135,\" - P4 I3\"),\"\")","v":""},{"$f":"IF(CONCATENATE(C$22,O$3)=Matriz!$H$180,CONCATENATE(Matriz!A180,\" - P4 I3\"),\"\")","v":""},{"$f":"IF(CONCATENATE(C$22,O$3)=Matriz!$H$225,CONCATENATE(Matriz!A225,\" - P4 I3\"),\"\")","v":""},{"$f":"IF(CONCATENATE(C$22,T$3)=Matriz!$H$45,CONCATENATE(Matriz!A45,\" - P4 I4\"),\"\")","v":"R5\nSISTEMAS DE INFORMACIÓN Y COMUNICACIÓN - P4 I4"},{"$f":"IF(CONCATENATE(C$22,T$3)=Matriz!$H$90,CONCATENATE(Matriz!A90,\" - P4 I4\"),\"\")","v":""},{"$f":"IF(CONCATENATE(C$22,T$3)=Matriz!$H$135,CONCATENATE(Matriz!A135,\" - P4 I4\"),\"\")","v":""},{"$f":"IF(CONCATENATE(C$22,T$3)=Matriz!$H$180,CONCATENATE(Matriz!A180,\" - P4 I4\"),\"\")","v":""},{"$f":"IF(CONCATENATE(C$22,T$3)=Matriz!$H$225,CONCATENATE(Matriz!A225,\" - P4 I4\"),\"\")","v":""},{"$f":"IF(CONCATENATE(C$22,Y$3)=Matriz!$H$45,CONCATENATE(Matriz!A45,\" - P4 I5\"),\"\")","v":""},{"$f":"IF(CONCATENATE(C$22,Y$3)=Matriz!$H$90,CONCATENATE(Matriz!A90,\" - P4 I5\"),\"\")","v":"R10\nCONTROL INTERNO - P4 I5"},{"$f":"IF(CONCATENATE(C$22,Y$3)=Matriz!$H$135,CONCATENATE(Matriz!A135,\" - P4 I5\"),\"\")","v":""},{"$f":"IF(CONCATENATE(C$22,Y$3)=Matriz!$H$180,CONCATENATE(Matriz!A180,\" - P4 I5\"),\"\")","v":""},{"$f":"IF(CONCATENATE(C$22,Y$3)=Matriz!$H$225,CONCATENATE(Matriz!A225,\" - P4 I5\"),\"\")","v":""},null,null,null,null,null,9,20,180]
[null,null,null,null,{"$f":"IF(CONCATENATE(C$27,E$3)=Matriz!$H$9,CONCATENATE(Matriz!A$9,\" - P5 I1\"),\"\")","v":""},{"$f":"IF(CONCATENATE($C$27,E$3)=Matriz!$H$54,CONCATENATE(Matriz!A$54,\" - P5 I1\"),\"\")","v":""},{"$f":"IF(CONCATENATE($C$27,E$3)=Matriz!$H$99,CONCATENATE(Matriz!A$99,\" - P5 I1\"),\"\")","v":""},{"$f":"IF(CONCATENATE($C$27,E$3)=Matriz!$H$144,CONCATENATE(Matriz!A$144,\" - P5 I1\"),\"\")","v":""},{"$f":"IF(CONCATENATE($C$27,E$3)=Matriz!$H$189,CONCATENATE(Matriz!A$189,\" - P5 I1\"),\"\")","v":""},{"$f":"IF(CONCATENATE(C$27,J$3)=Matriz!$H$9,CONCATENATE(Matriz!A$9,\" - P5 I2\"),\"\")","v":""},{"$f":"IF(CONCATENATE($C$27,J$3)=Matriz!$H$54,CONCATENATE(Matriz!A$54,\" - P5 I2\"),\"\")","v":""},{"$f":"IF(CONCATENATE($C$27,J$3)=Matriz!$H$99,CONCATENATE(Matriz!A$99,\" - P5 I2\"),\"\")","v":""},{"$f":"IF(CONCATENATE($C$27,J$3)=Matriz!$H$144,CONCATENATE(Matriz!A$144,\" - P5 I2\"),\"\")","v":""},{"$f":"IF(CONCATENATE($C$27,J$3)=Matriz!$H$189,CONCATENATE(Matriz!A$189,\" - P5 I2\"),\"\")","v":""},{"$f":"IF(CONCATENATE(C$27,O$3)=Matriz!$H$9,CONCATENATE(Matriz!A$9,\" - P5 I3\"),\"\")","v":""},{"$f":"IF(CONCATENATE($C$27,O$3)=Matriz!$H$54,CONCATENATE(Matriz!A$54,\" - P5 I3\"),\"\")","v":""},{"$f":"IF(CONCATENATE($C$27,O$3)=Matriz!$H$99,CONCATENATE(Matriz!A$99,\" - P5 I3\"),\"\")","v":""},{"$f":"IF(CONCATENATE($C$27,O$3)=Matriz!$H$144,CONCATENATE(Matriz!A$144,\" - P5 I3\"),\"\")","v":""},{"$f":"IF(CONCATENATE($C$27,O$3)=Matriz!$H$189,CONCATENATE(Matriz!A$189,\" - P5 I3\"),\"\")","v":""},{"$f":"IF(CONCATENATE($C$27,T$3)=Matriz!$H$9,CONCATENATE(Matriz!A$9,\" - P5 I4\"),\"\")","v":""},{"$f":"IF(CONCATENATE($C$27,T$3)=Matriz!$H$54,CONCATENATE(Matriz!A$54,\" - P5 I4\"),\"\")","v":""},{"$f":"IF(CONCATENATE($C$27,T$3)=Matriz!$H$99,CONCATENATE(Matriz!A$99,\" - P5 I4\"),\"\")","v":""},{"$f":"IF(CONCATENATE($C$27,T$3)=Matriz!$H$144,CONCATENATE(Matriz!A$144,\" - P5 I4\"),\"\")","v":""},{"$f":"IF(CONCATENATE($C$27,T$3)=Matriz!$H$189,CONCATENATE(Matriz!A$189,\" - P5 I4\"),\"\")","v":""},{"$f":"IF(CONCATENATE($C$27,Y$3)=Matriz!$H$9,CONCATENATE(Matriz!A$9,\" - P5 I5\"),\"\")","v":""},{"$f":"IF(CONCATENATE($C$27,Y$3)=Matriz!$H$54,CONCATENATE(Matriz!A$54,\" - P5 I5\"),\"\")","v":""},{"$f":"IF(CONCATENATE($C$27,Y$3)=Matriz!$H$99,CONCATENATE(Matriz!A$99,\" - P5 I5\"),\"\")","v":""},{"$f":"IF(CONCATENATE($C$27,Y$3)=Matriz!$H$144,CONCATENATE(Matriz!A$144,\" - P5 I5\"),\"\")","v":""},{"$f":"IF(CONCATENATE($C$27,Y$3)=Matriz!$H$189,CONCATENATE(Matriz!A$189,\" - P5 I5\"),\"\")","v":""},null,null,null,null,null,9,21,189]
[null,null,1,"RARA VEZ",{"$f":"IF(CONCATENATE($C$27,E$3)=Matriz!$H$18,CONCATENATE(Matriz!A$18,\" - P5 I1\"),\"\")","v":""},{"$f":"IF(CONCATENATE($C$27,E$3)=Matriz!$H$63,CONCATENATE(Matriz!A$63,\" - P5 I1\"),\"\")","v":""},{"$f":"IF(CONCATENATE($C$27,E$3)=Matriz!$H$108,CONCATENATE(Matriz!A$108,\" - P5 I1\"),\"\")","v":""},{"$f":"IF(CONCATENATE($C$27,E$3)=Matriz!$H$153,CONCATENATE(Matriz!A$153,\" - P5 I1\"),\"\")","v":""},{"$f":"IF(CONCATENATE($C$27,E$3)=Matriz!$H$198,CONCATENATE(Matriz!A$198,\" - P5 I1\"),\"\")","v":""},{"$f":"IF(CONCATENATE($C$27,J$3)=Matriz!$H$18,CONCATENATE(Matriz!A$18,\" - P5 I2\"),\"\")","v":""},{"$f":"IF(CONCATENATE($C$27,J$3)=Matriz!$H$63,CONCATENATE(Matriz!A$63,\" - P5 I2\"),\"\")","v":""},{"$f":"IF(CONCATENATE($C$27,J$3)=Matriz!$H$108,CONCATENATE(Matriz!A$108,\" - P5 I2\"),\"\")","v":""},{"$f":"IF(CONCATENATE($C$27,J$3)=Matriz!$H$153,CONCATENATE(Matriz!A$153,\" - P5 I2\"),\"\")","v":""},{"$f":"IF(CONCATENATE($C$27,J$3)=Matriz!$H$198,CONCATENATE(Matriz!A$198,\" - P5 I2\"),\"\")","v":""},{"$f":"IF(CONCATENATE($C$27,O$3)=Matriz!$H$18,CONCATENATE(Matriz!A$18,\" - P5 I3\"),\"\")","v":""},{"$f":"IF(CONCATENATE($C$27,O$3)=Matriz!$H$63,CONCATENATE(Matriz!A$63,\" - P5 I3\"),\"\")","v":""},{"$f":"IF(CONCATENATE($C$27,O$3)=Matriz!$H$108,CONCATENATE(Matriz!A$108,\" - P5 I3\"),\"\")","v":""},{"$f":"IF(CONCATENATE($C$27,O$3)=Matriz!$H$153,CONCATENATE(Matriz!A$153,\" - P5 I3\"),\"\")","v":""},{"$f":"IF(CONCATENATE($C$27,O$3)=Matriz!$H$198,CONCATENATE(Matriz!A$198,\" - P5 I3\"),\"\")","v":""},{"$f":"IF(CONCATENATE($C$27,T$3)=Matriz!$H$18,CONCATENATE(Matriz!A$18,\" - P5 I4\"),\"\")","v":""},{"$f":"IF(CONCATENATE($C$27,T$3)=Matriz!$H$63,CONCATENATE(Matriz!A$63,\" - P5 I4\"),\"\")","v":""},{"$f":"IF(CONCATENATE($C$27,T$3)=Matriz!$H$108,CONCATENATE(Matriz!A$108,\" - P5 I4\"),\"\")","v":""},{"$f":"IF(CONCATENATE($C$27,T$3)=Matriz!$H$153,CONCATENATE(Matriz!A$153,\" - P5 I4\"),\"\")","v":""},{"$f":"IF(CONCATENATE($C$27,T$3)=Matriz!$H$198,CONCATENATE(Matriz!A$198,\" - P5 I4\"),\"\")","v":""},{"$f":"IF(CONCATENATE($C$27,Y$3)=Matriz!$H$18,CONCATENATE(Matriz!A$18,\" - P5 I5\"),\"\")","v":""},{"$f":"IF(CONCATENATE($C$27,Y$3)=Matriz!$H$63,CONCATENATE(Matriz!A$63,\" - P5 I5\"),\"\")","v":""},{"$f":"IF(CONCATENATE($C$27,Y$3)=Matriz!$H$108,CONCATENATE(Matriz!A$108,\" - P5 I5\"),\"\")","v":""},{"$f":"IF(CONCATENATE($C$27,Y$3)=Matriz!$H$153,CONCATENATE(Matriz!A$153,\" - P5 I5\"),\"\")","v":""},{"$f":"IF(CONCATENATE($C$27,Y$3)=Matriz!$H$198,CONCATENATE(Matriz!A$198,\" - P5 I5\"),\"\")","v":""},null,null,null,null,null,9,22,198]
[null,null,null,null,{"$f":"IF(CONCATENATE($C$27,E$3)=Matriz!$H$27,CONCATENATE(Matriz!A$27,\" - P5 I1\"),\"\")","v":""},{"$f":"IF(CONCATENATE($C$27,E$3)=Matriz!$H$72,CONCATENATE(Matriz!A$72,\" - P5 I1\"),\"\")","v":""},{"$f":"IF(CONCATENATE($C$27,E$3)=Matriz!$H$117,CONCATENATE(Matriz!A$117,\" - P5 I1\"),\"\")","v":""},{"$f":"IF(CONCATENATE($C$27,E$3)=Matriz!$H$162,CONCATENATE(Matriz!A$162,\" - P5 I1\"),\"\")","v":""},{"$f":"IF(CONCATENATE($C$27,E$3)=Matriz!$H$207,CONCATENATE(Matriz!A$207,\" - P5 I1\"),\"\")","v":""},{"$f":"IF(CONCATENATE($C$27,J$3)=Matriz!$H$27,CONCATENATE(Matriz!A$27,\" - P5 I2\"),\"\")","v":""},{"$f":"IF(CONCATENATE($C$27,J$3)=Matriz!$H$72,CONCATENATE(Matriz!A$72,\" - P5 I2\"),\"\")","v":""},{"$f":"IF(CONCATENATE($C$27,J$3)=Matriz!$H$117,CONCATENATE(Matriz!A$117,\" - P5 I2\"),\"\")","v":""},{"$f":"IF(CONCATENATE($C$27,J$3)=Matriz!$H$162,CONCATENATE(Matriz!A$162,\" - P5 I2\"),\"\")","v":""},{"$f":"IF(CONCATENATE($C$27,J$3)=Matriz!$H$207,CONCATENATE(Matriz!A$207,\" - P5 I2\"),\"\")","v":""},{"$f":"IF(CONCATENATE($C$27,O$3)=Matriz!$H$27,CONCATENATE(Matriz!A$27,\" - P5 I3\"),\"\")","v":""},{"$f":"IF(CONCATENATE($C$27,O$3)=Matriz!$H$72,CONCATENATE(Matriz!A$72,\" - P5 I3\"),\"\")","v":""},{"$f":"IF(CONCATENATE($C$27,O$3)=Matriz!$H$117,CONCATENATE(Matriz!A$117,\" - P5 I3\"),\"\")","v":""},{"$f":"IF(CONCATENATE($C$27,O$3)=Matriz!$H$162,CONCATENATE(Matriz!A$162,\" - P5 I3\"),\"\")","v":""},{"$f":"IF(CONCATENATE($C$27,O$3)=Matriz!$H$207,CONCATENATE(Matriz!A$207,\" - P5 I3\"),\"\")","v":""},{"$f":"IF(CONCATENATE($C$27,T$3)=Matriz!$H$27,CONCATENATE(Matriz!A$27,\" - P5 I4\"),\"\")","v":""},{"$f":"IF(CONCATENATE($C$27,T$3)=Matriz!$H$72,CONCATENATE(Matriz!A$72,\" - P5 I4\"),\"\")","v":""},{"$f":"IF(CONCATENATE($C$27,T$3)=Matriz!$H$117,CONCATENATE(Matriz!A$117,\" - P5 I4\"),\"\")","v":""},{"$f":"IF(CONCATENATE($C$27,T$3)=Matriz!$H$162,CONCATENATE(Matriz!A$162,\" - P5 I4\"),\"\")","v":""},{"$f":"IF(CONCATENATE($C$27,T$3)=Matriz!$H$207,CONCATENATE(Matriz!A$207,\" - P5 I4\"),\"\")","v":""},{"$f":"IF(CONCATENATE($C$27,Y$3)=Matriz!$H$27,CONCATENATE(Matriz!A$27,\" - P5 I5\"),\"\")","v":""},{"$f":"IF(CONCATENATE($C$27,Y$3)=Matriz!$H$72,CONCATENATE(Matriz!A$72,\" - P5 I5\"),\"\")","v":""},{"$f":"IF(CONCATENATE($C$27,Y$3)=Matriz!$H$117,CONCATENATE(Matriz!A$117,\" - P5 I5\"),\"\")","v":""},{"$f":"IF(CONCATENATE($C$27,Y$3)=Matriz!$H$162,CONCATENATE(Matriz!A$162,\" - P5 I5\"),\"\")","v":""},{"$f":"IF(CONCATENATE($C$27,Y$3)=Matriz!$H$207,CONCATENATE(Matriz!A$207,\" - P5 I5\"),\"\")","v":""},null,null,null,null,null,9,23,207]
[null,null,null,null,{"$f":"IF(CONCATENATE($C$27,E$3)=Matriz!$H$36,CONCATENATE(Matriz!A$36,\" - P5 I1\"),\"\")","v":""},{"$f":"IF(CONCATENATE($C$27,E$3)=Matriz!$H$81,CONCATENATE(Matriz!A$81,\" - P5 I1\"),\"\")","v":""},{"$f":"IF(CONCATENATE($C$27,E$3)=Matriz!$H$126,CONCATENATE(Matriz!A$126,\" - P5 I1\"),\"\")","v":""},{"$f":"IF(CONCATENATE($C$27,E$3)=Matriz!$H$171,CONCATENATE(Matriz!A$171,\" - P5 I1\"),\"\")","v":""},{"$f":"IF(CONCATENATE($C$27,E$3)=Matriz!$H$216,CONCATENATE(Matriz!A$216,\" - P5 I1\"),\"\")","v":""},{"$f":"IF(CONCATENATE($C$27,J$3)=Matriz!$H$36,CONCATENATE(Matriz!A$36,\" - P5 I2\"),\"\")","v":""},{"$f":"IF(CONCATENATE($C$27,J$3)=Matriz!$H$81,CONCATENATE(Matriz!A$81,\" - P5 I2\"),\"\")","v":""},{"$f":"IF(CONCATENATE($C$27,J$3)=Matriz!$H$126,CONCATENATE(Matriz!A$126,\" - P5 I2\"),\"\")","v":""},{"$f":"IF(CONCATENATE($C$27,J$3)=Matriz!$H$171,CONCATENATE(Matriz!A$171,\" - P5 I2\"),\"\")","v":""},{"$f":"IF(CONCATENATE($C$27,J$3)=Matriz!$H$216,CONCATENATE(Matriz!A$216,\" - P5 I2\"),\"\")","v":""},{"$f":"IF(CONCATENATE($C$27,O$3)=Matriz!$H$36,CONCATENATE(Matriz!A$36,\" - P5 I3\"),\"\")","v":""},{"$f":"IF(CONCATENATE($C$27,O$3)=Matriz!$H$81,CONCATENATE(Matriz!A$81,\" - P5 I3\"),\"\")","v":""},{"$f":"IF(CONCATENATE($C$27,O$3)=Matriz!$H$126,CONCATENATE(Matriz!A$126,\" - P5 I3\"),\"\")","v":""},{"$f":"IF(CONCATENATE($C$27,O$3)=Matriz!$H$171,CONCATENATE(Matriz!A$171,\" - P5 I3\"),\"\")","v":""},{"$f":"IF(CONCATENATE($C$27,O$3)=Matriz!$H$216,CONCATENATE(Matriz!A$216,\" - P5 I3\"),\"\")","v":""},{"$f":"IF(CONCATENATE($C$27,T$3)=Matriz!$H$36,CONCATENATE(Matriz!A$36,\" - P5 I4\"),\"\")","v":""},{"$f":"IF(CONCATENATE($C$27,T$3)=Matriz!$H$81,CONCATENATE(Matriz!A$81,\" - P5 I4\"),\"\")","v":""},{"$f":"IF(CONCATENATE($C$27,T$3)=Matriz!$H$126,CONCATENATE(Matriz!A$126,\" - P5 I4\"),\"\")","v":""},{"$f":"IF(CONCATENATE($C$27,T$3)=Matriz!$H$171,CONCATENATE(Matriz!A$171,\" - P5 I4\"),\"\")","v":""},{"$f":"IF(CONCATENATE($C$27,T$3)=Matriz!$H$216,CONCATENATE(Matriz!A$216,\" - P5 I4\"),\"\")","v":""},{"$f":"IF(CONCATENATE($C$27,Y$3)=Matriz!$H$36,CONCATENATE(Matriz!A$36,\" - P5 I5\"),\"\")","v":""},{"$f":"IF(CONCATENATE($C$27,Y$3)=Matriz!$H$81,CONCATENATE(Matriz!A$81,\" - P5 I5\"),\"\")","v":""},{"$f":"IF(CONCATENATE($C$27,Y$3)=Matriz!$H$126,CONCATENATE(Matriz!A$126,\" - P5 I5\"),\"\")","v":""},{"$f":"IF(CONCATENATE($C$27,Y$3)=Matriz!$H$171,CONCATENATE(Matriz!A$171,\" - P5 I5\"),\"\")","v":""},{"$f":"IF(CONCATENATE($C$27,Y$3)=Matriz!$H$216,CONCATENATE(Matriz!A$216,\" - P5 I5\"),\"\")","v":""},null,null,null,null,null,9,24,216]
[null,null,null,null,{"$f":"IF(CONCATENATE($C$27,E$3)=Matriz!$H$45,CONCATENATE(Matriz!A$45,\" - P5 I1\"),\"\")","v":""},{"$f":"IF(CONCATENATE($C$27,E$3)=Matriz!$H$90,CONCATENATE(Matriz!A$90,\" - P5 I1\"),\"\")","v":""},{"$f":"IF(CONCATENATE($C$27,E$3)=Matriz!$H$135,CONCATENATE(Matriz!A$135,\" - P5 I1\"),\"\")","v":""},{"$f":"IF(CONCATENATE($C$27,E$3)=Matriz!$H$180,CONCATENATE(Matriz!A$180,\" - P5 I1\"),\"\")","v":""},{"$f":"IF(CONCATENATE($C$27,E$3)=Matriz!$H$225,CONCATENATE(Matriz!A$225,\" - P5 I1\"),\"\")","v":""},{"$f":"IF(CONCATENATE($C$27,J$3)=Matriz!$H$45,CONCATENATE(Matriz!A$45,\" - P5 I2\"),\"\")","v":""},{"$f":"IF(CONCATENATE($C$27,J$3)=Matriz!$H$90,CONCATENATE(Matriz!A$90,\" - P5 I2\"),\"\")","v":""},{"$f":"IF(CONCATENATE($C$27,J$3)=Matriz!$H$135,CONCATENATE(Matriz!A$135,\" - P5 I2\"),\"\")","v":""},{"$f":"IF(CONCATENATE($C$27,J$3)=Matriz!$H$180,CONCATENATE(Matriz!A$180,\" - P5 I2\"),\"\")","v":""},{"$f":"IF(CONCATENATE($C$27,J$3)=Matriz!$H$225,CONCATENATE(Matriz!A$225,\" - P5 I2\"),\"\")","v":""},{"$f":"IF(CONCATENATE($C$27,O$3)=Matriz!$H$45,CONCATENATE(Matriz!A$45,\" - P5 I3\"),\"\")","v":""},{"$f":"IF(CONCATENATE($C$27,O$3)=Matriz!$H$90,CONCATENATE(Matriz!A$90,\" - P5 I3\"),\"\")","v":""},{"$f":"IF(CONCATENATE($C$27,O$3)=Matriz!$H$135,CONCATENATE(Matriz!A$135,\" - P5 I3\"),\"\")","v":""},{"$f":"IF(CONCATENATE($C$27,O$3)=Matriz!$H$180,CONCATENATE(Matriz!A$180,\" - P5 I3\"),\"\")","v":""},{"$f":"IF(CONCATENATE($C$27,O$3)=Matriz!$H$225,CONCATENATE(Matriz!A$225,\" - P5 I3\"),\"\")","v":""},{"$f":"IF(CONCATENATE($C$27,T$3)=Matriz!$H$45,CONCATENATE(Matriz!A$45,\" - P5 I4\"),\"\")","v":""},{"$f":"IF(CONCATENATE($C$27,T$3)=Matriz!$H$90,CONCATENATE(Matriz!A$90,\" - P5 I4\"),\"\")","v":""},{"$f":"IF(CONCATENATE($C$27,T$3)=Matriz!$H$135,CONCATENATE(Matriz!A$135,\" - P5 I4\"),\"\")","v":""},{"$f":"IF(CONCATENATE($C$27,T$3)=Matriz!$H$180,CONCATENATE(Matriz!A$180,\" - P5 I4\"),\"\")","v":""},{"$f":"IF(CONCATENATE($C$27,T$3)=Matriz!$H$225,CONCATENATE(Matriz!A$225,\" - P5 I4\"),\"\")","v":""},{"$f":"IF(CONCATENATE($C$27,Y$3)=Matriz!$H$45,CONCATENATE(Matriz!A$45,\" - P5 I5\"),\"\")","v":""},{"$f":"IF(CONCATENATE($C$27,Y$3)=Matriz!$H$90,CONCATENATE(Matriz!A$90,\" - P5 I5\"),\"\")","v":""},{"$f":"IF(CONCATENATE($C$27,Y$3)=Matriz!$H$135,CONCATENATE(Matriz!A$135,\" - P5 I5\"),\"\")","v":""},{"$f":"IF(CONCATENATE($C$27,Y$3)=Matriz!$H$180,CONCATENATE(Matriz!A$180,\" - P5 I5\"),\"\")","v":""},{"$f":"IF(CONCATENATE($C$27,Y$3)=Matriz!$H$225,CONCATENATE(Matriz!A$225,\" - P5 I5\"),\"\")","v":""},null,null,null,null,null,9,25,225]

{"sheet":"Mapa Riesgo Residual","index":4,"n_rows":30,"n_cols":37,"rows_kept":30,"cut":false,"hidden":false,"merged":[[43,31,43,33],[46,31,46,33],[49,31,49,33],[2,24,2,28],[3,24,3,28],[32,30,37,33],[40,31,40,33],[2,9,2,13],[1,2,1,28],[5,1,29,1],[3,9,3,13],[2,14,2,18],[3,14,3,18],[2,19,2,23],[3,19,3,23],[4,2,4,3],[2,4,2,8],[3,2,3,3],[3,4,3,8],[21,2,23,2],[21,3,23,3],[26,3,28,3],[26,2,28,2],[6,3,8,3],[6,2,8,2],[11,2,13,2],[11,3,13,3],[16,2,18,2],[16,3,18,3]]}
[]
[null,null,"IMPACTO"]
[null,null,null,null,1,null,null,null,null,2,null,null,null,null,3,null,null,null,null,4,null,null,null,null,5]
[null,null,null,null,"INSIGNIFICANTE",null,null,null,null,"MENOR",null,null,null,null,"MODERADO",null,null,null,null,"MAYOR",null,null,null,null,"CATASTRÓFICO"]
[]
[null,"PROBABILIDAD",null,null,{"$f":"IF(CONCATENATE(C$7,E$3)=Matriz!$AU$9,CONCATENATE(Matriz!A9,\" - P1 I1\"),\"\")","v":""},{"$f":"IF(CONCATENATE(C$7,E$3)=Matriz!$AU$54,CONCATENATE(Matriz!A54,\" - P1 I1\"),\"\")","v":""},{"$f":"IF(CONCATENATE(C$7,E$3)=Matriz!$AU$99,CONCATENATE(Matriz!A99,\" - P1 I1\"),\"\")","v":""},{"$f":"IF(CONCATENATE(C$7,E$3)=Matriz!$AU$144,CONCATENATE(Matriz!A144,\" - P1 I1\"),\"\")","v":""},{"$f":"IF(CONCATENATE(C$7,E$3)=Matriz!$AU$189,CONCATENATE(Matriz!A189,\" - P1 I1\"),\"\")","v":""},{"$f":"IF(CONCATENATE(C$7,J$3)=Matriz!$AU$9,CONCATENATE(Matriz!A9,\" - P1 I2\"),\"\")","v":""},{"$f":"IF(CONCATENATE(C$7,J$3)=Matriz!$AU$54,CONCATENATE(Matriz!A54,\" - P1 I2\"),\"\")","v":""},{"$f":"IF(CONCATENATE(C$7,J$3)=Matriz!$AU$99,CONCATENATE(Matriz!A99,\" - P1 I2\"),\"\")","v":""},{"$f":"IF(CONCATENATE(C$7,J$3)=Matriz!$AU$144,CONCATENATE(Matriz!A144,\" - P1 I2\"),\"\")","v":""},{"$f":"IF(CONCATENATE(C$7,J$3)=Matriz!$AU$189,CONCATENATE(Matriz!A189,\" - P1 I2\"),\"\")","v":""},{"$f":"IF(CONCATENATE(C$7,O$3)=Matriz!$AU$9,CONCATENATE(Matriz!A9,\" - P1 I3\"),\"\")","v":""},{"$f":"IF(CONCATENATE(C$7,O$3)=Matriz!$AU$54,CONCATENATE(Matriz!A54,\" - P1 I3\"),\"\")","v":""},{"$f":"IF(CONCATENATE(C$7,O$3)=Matriz!$AU$99,CONCATENATE(Matriz!A99,\" - P1 I3\"),\"\")","v":""},{"$f":"IF(CONCATENATE(C$7,O$3)=Matriz!$AU$144,CONCATENATE(Matriz!A144,\" - P1 I3\"),\"\")","v":""},{"$f":"IF(CONCATENATE(C$7,O$3)=Matriz!$AU$189,CONCATENATE(Matriz!A189,\" - P1 I3\"),\"\")","v":""},{"$f":"IF(CONCATENATE(C$7,T$3)=Matriz!$AU$9,CONCATENATE(Matriz!A9,\" - P1 I4\"),\"\")","v":""},{"$f":"IF(CONCATENATE(C$7,T$3)=Matriz!$AU$54,CONCATENATE(Matriz!A54,\" - P1 I4\"),\"\")","v":""},{"$f":"IF(CONCATENATE(C$7,T$3)=Matriz!$AU$99,CONCATENATE(Matriz!A99,\" - P1 I4\"),\"\")","v":""},{"$f":"IF(CONCATENATE(C$7,T$3)=Matriz!$AU$144,CONCATENATE(Matriz!A144,\" - P1 I4\"),\"\")","v":""},{"$f":"IF(CONCATENATE(C$7,T$3)=Matriz!$AU$189,CONCATENATE(Matriz!A189,\" - P1 I4\"),\"\")","v":""},{"$f":"IF(CONCATENATE(C$7,Y$3)=Matriz!$AU$9,CONCATENATE(Matriz!A9,\" - P1 I5\"),\"\")","v":""},{"$f":"IF(CONCATENATE(C$7,Y$3)=Matriz!$AU$54,CONCATENATE(Matriz!A54,\" - P1 I5\"),\"\")","v":""},{"$f":"IF(CONCATENATE(C$7,Y$3)=Matriz!$AU$99,CONCATENATE(Matriz!A99,\" - P1 I5\"),\"\")","v":""},{"$f":"IF(CONCATENATE(C$7,Y$3)=Matriz!$AU$144,CONCATENATE(Matriz!A144,\" - P1 I5\"),\"\")","v":""},{"$f":"IF(CONCATENATE(C$7,Y$3)=Matriz!$AU$189,CONCATENATE(Matriz!A189,\" - P1 I5\"),\"\")","v":""},null,null,null,null,null,9,1,{"$f":"AJ6*AI6","v":9}]
[null,null,5,"CASI SEGURO",{"$f":"IF(CONCATENATE(C$7,E$3)=Matriz!$AU$18,CONCATENATE(Matriz!A18,\" - P1 I1\"),\"\")","v":""},{"$f":"IF(CONCATENATE(C$7,E$3)=Matriz!$AU$63,CONCATENATE(Matriz!A63,\" - P1 I1\"),\"\")","v":""},{"$f":"IF(CONCATENATE(C$7,E$3)=Matriz!$AU$108,CONCATENATE(Matriz!A108,\" - P1 I1\"),\"\")","v":""},{"$f":"IF(CONCATENATE(C$7,E$3)=Matriz!$AU$153,CONCATENATE(Matriz!A153,\" - P1 I1\"),\"\")","v":""},{"$f":"IF(CONCATENATE(C$7,E$3)=Matriz!$AU$198,CONCATENATE(Matriz!A198,\" - P1 I1\"),\"\")","v":""},{"$f":"IF(CONCATENATE(C$7,J$3)=Matriz!$AU$18,CONCATENATE(Matriz!A18,\" - P1 I2\"),\"\")","v":""},{"$f":"IF(CONCATENATE(C$7,J$3)=Matriz!$AU$63,CONCATENATE(Matriz!A63,\" - P1 I2\"),\"\")","v":""},{"$f":"IF(CONCATENATE(C$7,J$3)=Matriz!$AU$108,CONCATENATE(Matriz!A108,\" - P1 I2\"),\"\")","v":""},{"$f":"IF(CONCATENATE(C$7,J$3)=Matriz!$AU$153,CONCATENATE(Matriz!A153,\" - P1 I2\"),\"\")","v":""},{"$f":"IF(CONCATENATE(C$7,J$3)=Matriz!$AU$198,CONCATENATE(Matriz!A198,\" - P1 I2\"),\"\")","v":""},{"$f":"IF(CONCATENATE(C$7,O$3)=Matriz!$AU$18,CONCATENATE(Matriz!A18,\" - P1 I3\"),\"\")","v":""},{"$f":"IF(CONCATENATE(C$7,O$3)=Matriz!$AU$63,CONCATENATE(Matriz!A63,\" - P1 I3\"),\"\")","v":""},{"$f":"IF(CONCATENATE(C$7,O$3)=Matriz!$AU$108,CONCATENATE(Matriz!A108,\" - P1 I3\"),\"\")","v":""},{"$f":"IF(CONCATENATE(C$7,O$3)=Matriz!$AU$153,CONCATENATE(Matriz!A153,\" - P1 I3\"),\"\")","v":""},{"$f":"IF(CONCATENATE(C$7,O$3)=Matriz!$AU$198,CONCATENATE(Matriz!A198,\" - P1 I3\"),\"\")","v":""},{"$f":"IF(CONCATENATE(C$7,T$3)=Matriz!$AU$18,CONCATENATE(Matriz!A18,\" - P1 I4\"),\"\")","v":""},{"$f":"IF(CONCATENATE(C$7,T$3)=Matriz!$AU$63,CONCATENATE(Matriz!A63,\" - P1 I4\"),\"\")","v":""},{"$f":"IF(CONCATENATE(C$7,T$3)=Matriz!$AU$108,CONCATENATE(Matriz!A108,\" - P1 I4\"),\"\")","v":""},{"$f":"IF(CONCATENATE(C$7,T$3)=Matriz!$AU$153,CONCATENATE(Matriz!A153,\" - P1 I4\"),\"\")","v":""},{"$f":"IF(CONCATENATE(C$7,T$3)=Matriz!$AU$198,CONCATENATE(Matriz!A198,\" - P1 I4\"),\"\")","v":""},{"$f":"IF(CONCATENATE(C$7,Y$3)=Matriz!$AU$18,CONCATENATE(Matriz!A18,\" - P1 I5\"),\"\")","v":""},{"$f":"IF(CONCATENATE(C$7,Y$3)=Matriz!$AU$63,CONCATENATE(Matriz!A63,\" - P1 I5\"),\"\")","v":""},{"$f":"IF(CONCATENATE(C$7,Y$3)=Matriz!$AU$108,CONCATENATE(Matriz!A108,\" - P1 I5\"),\"\")","v":""},{"$f":"IF(CONCATENATE(C$7,Y$3)=Matriz!$AU$153,CONCATENATE(Matriz!A153,\" - P1 I5\"),\"\")","v":""},{"$f":"IF(CONCATENATE(C$7,Y$3)=Matriz!$AU$198,CONCATENATE(Matriz!A198,\" - P1 I5\"),\"\")","v":""},null,null,null,null,null,9,2,18]
[null,null,null,null,{"$f":"IF(CONCATENATE(C$7,E$3)=Matriz!$AU$27,CONCATENATE(Matriz!A27,\" - P1 I1\"),\"\")","v":""},{"$f":"IF(CONCATENATE(C$7,E$3)=Matriz!$AU$72,CONCATENATE(Matriz!A72,\" - P1 I1\"),\"\")","v":""},{"$f":"IF(CONCATENATE(C$7,E$3)=Matriz!$AU$117,CONCATENATE(Matriz!A117,\" - P1 I1\"),\"\")","v":""},{"$f":"IF(CONCATENATE(C$7,E$3)=Matriz!$AU$162,CONCATENATE(Matriz!A162,\" - P1 I1\"),\"\")","v":""},{"$f":"IF(CONCATENATE(C$7,E$3)=Matriz!$AU$207,CONCATENATE(Matriz!A207,\" - P1 I1\"),\"\")","v":""},{"$f":"IF(CONCATENATE(C$7,J$3)=Matriz!$AU$27,CONCATENATE(Matriz!A27,\" - P1 I2\"),\"\")","v":""},{"$f":"IF(CONCATENATE(C$7,J$3)=Matriz!$AU$72,CONCATENATE(Matriz!A72,\" - P1 I2\"),\"\")","v":""},{"$f":"IF(CONCATENATE(C$7,J$3)=Matriz!$AU$117,CONCATENATE(Matriz!A117,\" - P1 I2\"),\"\")","v":""},{"$f":"IF(CONCATENATE(C$7,J$3)=Matriz!$AU$162,CONCATENATE(Matriz!A162,\" - P1 I2\"),\"\")","v":""},{"$f":"IF(CONCATENATE(C$7,J$3)=Matriz!$AU$207,CONCATENATE(Matriz!A207,\" - P1 I2\"),\"\")","v":""},{"$f":"IF(CONCATENATE(C$7,O$3)=Matriz!$AU$27,CONCATENATE(Matriz!A27,\" - P1 I3\"),\"\")","v":""},{"$f":"IF(CONCATENATE(C$7,O$3)=Matriz!$AU$72,CONCATENATE(Matriz!A72,\" - P1 I3\"),\"\")","v":""},{"$f":"IF(CONCATENATE(C$7,O$3)=Matriz!$AU$117,CONCATENATE(Matriz!A117,\" - P1 I3\"),\"\")","v":""},{"$f":"IF(CONCATENATE(C$7,O$3)=Matriz!$AU$162,CONCATENATE(Matriz!A162,\" - P1 I3\"),\"\")","v":""},{"$f":"IF(CONCATENATE(C$7,O$3)=Matriz!$AU$207,CONCATENATE(Matriz!A207,\" - P1 I3\"),\"\")","v":""},{"$f":"IF(CONCATENATE(C$7,T$3)=Matriz!$AU$27,CONCATENATE(Matriz!A27,\" - P1 I4\"),\"\")","v":""},{"$f":"IF(CONCATENATE(C$7,T$3)=Matriz!$AU$72,CONCATENATE(Matriz!A72,\" - P1 I4\"),\"\")","v":""},{"$f":"IF(CONCATENATE(C$7,T$3)=Matriz!$AU$117,CONCATENATE(Matriz!A117,\" - P1 I4\"),\"\")","v":""},{"$f":"IF(CONCATENATE(C$7,T$3)=Matriz!$AU$162,CONCATENATE(Matriz!A162,\" - P1 I4\"),\"\")","v":""},{"$f":"IF(CONCATENATE(C$7,T$3)=Matriz!$AU$207,CONCATENATE(Matriz!A207,\" - P1 I4\"),\"\")","v":""},{"$f":"IF(CONCATENATE(C$7,Y$3)=Matriz!$AU$27,CONCATENATE(Matriz!A27,\" - P1 I5\"),\"\")","v":""},{"$f":"IF(CONCATENATE(C$7,Y$3)=Matriz!$AU$72,CONCATENATE(Matriz!A72,\" - P1 I5\"),\"\")","v":""},{"$f":"IF(CONCATENATE(C$7,Y$3)=Matriz!$AU$117,CONCATENATE(Matriz!A117,\" - P1 I5\"),\"\")","v":""},{"$f":"IF(CONCATENATE(C$7,Y$3)=Matriz!$AU$162,CONCATENATE(Matriz!A162,\" - P1 I5\"),\"\")","v":""},{"$f":"IF(CONCATENATE(C$7,Y$3)=Matriz!$AU$207,CONCATENATE(Matriz!A207,\" - P1 I5\"),\"\")","v":""},null,null,null,null,null,9,3,27]
[null,null,null,null,{"$f":"IF(CONCATENATE(C$7,E$3)=Matriz!$AU$36,CONCATENATE(Matriz!A36,\" - P1 I1\"),\"\")","v":""},{"$f":"IF(CONCATENATE(C$7,E$3)=Matriz!$AU$81,CONCATENATE(Matriz!A81,\" - P1 I1\"),\"\")","v":""},{"$f":"IF(CONCATENATE(C$7,E$3)=Matriz!$AU$126,CONCATENATE(Matriz!A126,\" - P1 I1\"),\"\")","v":""},{"$f":"IF(CONCATENATE(C$7,E$3)=Matriz!$AU$171,CONCATENATE(Matriz!A171,\" - P1 I1\"),\"\")","v":""},{"$f":"IF(CONCATENATE(C$7,E$3)=Matriz!$AU$216,CONCATENATE(Matriz!A216,\" - P1 I1\"),\"\")","v":""},{"$f":"IF(CONCATENATE(C$7,J$3)=Matriz!$AU$36,CONCATENATE(Matriz!A36,\" - P1 I2\"),\"\")","v":""},{"$f":"IF(CONCATENATE(C$7,J$3)=Matriz!$AU$81,CONCATENATE(Matriz!A81,\" - P1 I2\"),\"\")","v":""},{"$f":"IF(CONCATENATE(C$7,J$3)=Matriz!$AU$126,CONCATENATE(Matriz!A126,\" - P1 I2\"),\"\")","v":""},{"$f":"IF(CONCATENATE(C$7,J$3)=Matriz!$AU$171,CONCATENATE(Matriz!A171,\" - P1 I2\"),\"\")","v":""},{"$f":"IF(CONCATENATE(C$7,J$3)=Matriz!$AU$216,CONCATENATE(Matriz!A216,\" - P1 I2\"),\"\")","v":""},{"$f":"IF(CONCATENATE(C$7,O$3)=Matriz!$AU$36,CONCATENATE(Matriz!A36,\" - P1 I3\"),\"\")","v":""},{"$f":"IF(CONCATENATE(C$7,O$3)=Matriz!$AU$81,CONCATENATE(Matriz!A81,\" - P1 I3\"),\"\")","v":""},{"$f":"IF(CONCATENATE(C$7,O$3)=Matriz!$AU$126,CONCATENATE(Matriz!A126,\" - P1 I3\"),\"\")","v":""},{"$f":"IF(CONCATENATE(C$7,O$3)=Matriz!$AU$171,CONCATENATE(Matriz!A171,\" - P1 I3\"),\"\")","v":""},{"$f":"IF(CONCATENATE(C$7,O$3)=Matriz!$AU$216,CONCATENATE(Matriz!A216,\" - P1 I3\"),\"\")","v":""},{"$f":"IF(CONCATENATE(C$7,T$3)=Matriz!$AU$36,CONCATENATE(Matriz!A36,\" - P1 I4\"),\"\")","v":""},{"$f":"IF(CONCATENATE(C$7,T$3)=Matriz!$AU$81,CONCATENATE(Matriz!A81,\" - P1 I4\"),\"\")","v":""},{"$f":"IF(CONCATENATE(C$7,T$3)=Matriz!$AU$126,CONCATENATE(Matriz!A126,\" - P1 I4\"),\"\")","v":""},{"$f":"IF(CONCATENATE(C$7,T$3)=Matriz!$AU$171,CONCATENATE(Matriz!A171,\" - P1 I4\"),\"\")","v":""},{"$f":"IF(CONCATENATE(C$7,T$3)=Matriz!$AU$216,CONCATENATE(Matriz!A216,\" - P1 I4\"),\"\")","v":""},{"$f":"IF(CONCATENATE(C$7,Y$3)=Matriz!$AU$36,CONCATENATE(Matriz!A36,\" - P1 I5\"),\"\")","v":""},{"$f":"IF(CONCATENATE(C$7,Y$3)=Matriz!$AU$81,CONCATENATE(Matriz!A81,\" - P1 I5\"),\"\")","v":""},{"$f":"IF(CONCATENATE(C$7,Y$3)=Matriz!$AU$126,CONCATENATE(Matriz!A126,\" - P1 I5\"),\"\")","v":""},{"$f":"IF(CONCATENATE(C$7,Y$3)=Matriz!$AU$171,CONCATENATE(Matriz!A171,\" - P1 I5\"),\"\")","v":""},{"$f":"IF(CONCATENATE(C$7,Y$3)=Matriz!$AU$216,CONCATENATE(Matriz!A216,\" - P1 I5\"),\"\")","v":""},null,null,null,null,null,9,4,36]
[null,null,null,null,{"$f":"IF(CONCATENATE(C$7,E$3)=Matriz!$AU$45,CONCATENATE(Matriz!A45,\" - P1 I1\"),\"\")","v":""},{"$f":"IF(CONCATENATE(C$7,E$3)=Matriz!$AU$90,CONCATENATE(Matriz!A90,\" - P1 I1\"),\"\")","v":""},{"$f":"IF(CONCATENATE(C$7,E$3)=Matriz!$AU$135,CONCATENATE(Matriz!A135,\" - P1 I1\"),\"\")","v":""},{"$f":"IF(CONCATENATE(C$7,E$3)=Matriz!$AU$180,CONCATENATE(Matriz!A180,\" - P1 I1\"),\"\")","v":""},{"$f":"IF(CONCATENATE(C$7,E$3)=Matriz!$AU$225,CONCATENATE(Matriz!A225,\" - P1 I1\"),\"\")","v":""},{"$f":"IF(CONCATENATE(C$7,J$3)=Matriz!$AU$45,CONCATENATE(Matriz!A45,\" - P1 I2\"),\"\")","v":""},{"$f":"IF(CONCATENATE(C$7,J$3)=Matriz!$AU$90,CONCATENATE(Matriz!A90,\" - P1 I2\"),\"\")","v":""},{"$f":"IF(CONCATENATE(C$7,J$3)=Matriz!$AU$135,CONCATENATE(Matriz!A135,\" - P1 I2\"),\"\")","v":""},{"$f":"IF(CONCATENATE(C$7,J$3)=Matriz!$AU$180,CONCATENATE(Matriz!A180,\" - P1 I2\"),\"\")","v":""},{"$f":"IF(CONCATENATE(C$7,J$3)=Matriz!$AU$225,CONCATENATE(Matriz!A225,\" - P1 I2\"),\"\")","v":""},{"$f":"IF(CONCATENATE(C$7,O$3)=Matriz!$AU$45,CONCATENATE(Matriz!A45,\" - P1 I3\"),\"\")","v":""},{"$f":"IF(CONCATENATE(C$7,O$3)=Matriz!$AU$90,CONCATENATE(Matriz!A90,\" - P1 I3\"),\"\")","v":""},{"$f":"IF(CONCATENATE(C$7,O$3)=Matriz!$AU$135,CONCATENATE(Matriz!A135,\" - P1 I3\"),\"\")","v":""},{"$f":"IF(CONCATENATE(C$7,O$3)=Matriz!$AU$180,CONCATENATE(Matriz!A180,\" - P1 I3\"),\"\")","v":""},{"$f":"IF(CONCATENATE(C$7,O$3)=Matriz!$AU$225,CONCATENATE(Matriz!A225,\" - P1 I3\"),\"\")","v":""},{"$f":"IF(CONCATENATE(C$7,T$3)=Matriz!$AU$45,CONCATENATE(Matriz!A45,\" - P1 I4\"),\"\")","v":""},{"$f":"IF(CONCATENATE(C$7,T$3)=Matriz!$AU$90,CONCATENATE(Matriz!A90,\" - P1 I4\"),\"\")","v":""},{"$f":"IF(CONCATENATE(C$7,T$3)=Matriz!$AU$135,CONCATENATE(Matriz!A135,\" - P1 I4\"),\"\")","v":""},{"$f":"IF(CONCATENATE(C$7,T$3)=Matriz!$AU$180,CONCATENATE(Matriz!A180,\" - P1 I4\"),\"\")","v":""},{"$f":"IF(CONCATENATE(C$7,T$3)=Matriz!$AU$225,CONCATENATE(Matriz!A225,\" - P1 I4\"),\"\")","v":""},{"$f":"IF(CONCATENATE(C$7,Y$3)=Matriz!$AU$45,CONCATENATE(Matriz!A45,\" - P1 I5\"),\"\")","v":""},{"$f":"IF(CONCATENATE(C$7,Y$3)=Matriz!$AU$90,CONCATENATE(Matriz!A90,\" - P1 I5\"),\"\")","v":""},{"$f":"IF(CONCATENATE(C$7,Y$3)=Matriz!$AU$135,CONCATENATE(Matriz!A135,\" - P1 I5\"),\"\")","v":""},{"$f":"IF(CONCATENATE(C$7,Y$3)=Matriz!$AU$180,CONCATENATE(Matriz!A180,\" - P1 I5\"),\"\")","v":""},{"$f":"IF(CONCATENATE(C$7,Y$3)=Matriz!$AU$225,CONCATENATE(Matriz!A225,\" - P1 I5\"),\"\")","v":""},null,null,null,null,null,9,5,45]
[null,null,null,null,{"$f":"IF(CONCATENATE(C$12,E$3)=Matriz!$AU$9,CONCATENATE(Matriz!A9,\" - P2 I1\"),\"\")","v":""},{"$f":"IF(CONCATENATE(C$12,E$3)=Matriz!$AU$54,CONCATENATE(Matriz!A54,\" - P2 I1\"),\"\")","v":""},{"$f":"IF(CONCATENATE(C$12,E$3)=Matriz!$AU$99,CONCATENATE(Matriz!A99,\" - P2 I1\"),\"\")","v":""},{"$f":"IF(CONCATENATE(C$12,E$3)=Matriz!$AU$144,CONCATENATE(Matriz!A144,\" - P2 I1\"),\"\")","v":""},{"$f":"IF(CONCATENATE(C$12,E$3)=Matriz!$AU$189,CONCATENATE(Matriz!A189,\" - P2 I1\"),\"\")","v":""},{"$f":"IF(CONCATENATE(C$12,J$3)=Matriz!$AU$9,CONCATENATE(Matriz!A9,\" - P2 I2\"),\"\")","v":""},{"$f":"IF(CONCATENATE(C$12,J$3)=Matriz!$AU$54,CONCATENATE(Matriz!A54,\" - P2 I2\"),\"\")","v":""},{"$f":"IF(CONCATENATE(C$12,J$3)=Matriz!$AU$99,CONCATENATE(Matriz!A99,\" - P2 I2\"),\"\")","v":""},{"$f":"IF(CONCATENATE(C$12,J$3)=Matriz!$AU$144,CONCATENATE(Matriz!A144,\" - P2 I2\"),\"\")","v":""},{"$f":"IF(CONCATENATE(C$12,J$3)=Matriz!$AU$189,CONCATENATE(Matriz!A189,\" - P2 I2\"),\"\")","v":""},{"$f":"IF(CONCATENATE(C$12,O$3)=Matriz!$AU$9,CONCATENATE(Matriz!A9,\" - P2 I3\"),\"\")","v":""},{"$f":"IF(CONCATENATE(C$12,O$3)=Matriz!$AU$54,CONCATENATE(Matriz!A54,\" - P2 I3\"),\"\")","v":""},{"$f":"IF(CONCATENATE(C$12,O$3)=Matriz!$AU$99,CONCATENATE(Matriz!A99,\" - P2 I3\"),\"\")","v":""},{"$f":"IF(CONCATENATE(C$12,O$3)=Matriz!$AU$144,CONCATENATE(Matriz!A144,\" - P2 I3\"),\"\")","v":""},{"$f":"IF(CONCATENATE(C$12,O$3)=Matriz!$AU$189,CONCATENATE(Matriz!A189,\" - P2 I3\"),\"\")","v":""},{"$f":"IF(CONCATENATE(C$12,T$3)=Matriz!$AU$9,CONCATENATE(Matriz!A9,\" - P2 I4\"),\"\")","v":""},{"$f":"IF(CONCATENATE(C$12,T$3)=Matriz!$AU$54,CONCATENATE(Matriz!A54,\" - P2 I4\"),\"\")","v":""},{"$f":"IF(CONCATENATE(C$12,T$3)=Matriz!$AU$99,CONCATENATE(Matriz!A99,\" - P2 I4\"),\"\")","v":""},{"$f":"IF(CONCATENATE(C$12,T$3)=Matriz!$AU$144,CONCATENATE(Matriz!A144,\" - P2 I4\"),\"\")","v":""},{"$f":"IF(CONCATENATE(C$12,T$3)=Matriz!$AU$189,CONCATENATE(Matriz!A189,\" - P2 I4\"),\"\")","v":""},{"$f":"IF(CONCATENATE(C$12,Y$3)=Matriz!$AU$9,CONCATENATE(Matriz!A9,\" - P2 I5\"),\"\")","v":""},{"$f":"IF(CONCATENATE(C$12,Y$3)=Matriz!$AU$54,CONCATENATE(Matriz!A54,\" - P2 I5\"),\"\")","v":""},null,{"$f":"IF(CONCATENATE(C$12,Y$3)=Matriz!$AU$99,CONCATENATE(Matriz!A99,\" - P2 I5\"),\"\")","v":""},{"$f":"IF(CONCATENATE(C$12,Y$3)=Matriz!$AU$189,CONCATENATE(Matriz!A189,\" - P2 I5\"),\"\")","v":""},null,null,null,null,null,9,6,54]
[null,null,4,"PROBABLE",{"$f":"IF(CONCATENATE(C$12,E$3)=Matriz!$AU$18,CONCATENATE(Matriz!A18,\" - P2 I1\"),\"\")","v":""},{"$f":"IF(CONCATENATE(C$12,E$3)=Matriz!$AU$63,CONCATENATE(Matriz!A63,\" - P2 I1\"),\"\")","v":""},{"$f":"IF(CONCATENATE(C$12,E$3)=Matriz!$AU$108,CONCATENATE(Matriz!A108,\" - P2 I1\"),\"\")","v":""},{"$f":"IF(CONCATENATE(C$12,E$3)=Matriz!$AU$153,CONCATENATE(Matriz!A153,\" - P2 I1\"),\"\")","v":""},{"$f":"IF(CONCATENATE(C$12,E$3)=Matriz!$AU$198,CONCATENATE(Matriz!A198,\" - P2 I1\"),\"\")","v":""},{"$f":"IF(CONCATENATE(C$12,J$3)=Matriz!$AU$18,CONCATENATE(Matriz!A18,\" - P2 I2\"),\"\")","v":""},{"$f":"IF(CONCATENATE(C$12,J$3)=Matriz!$AU$63,CONCATENATE(Matriz!A63,\" - P2 I2\"),\"\")","v":""},{"$f":"IF(CONCATENATE(C$12,J$3)=Matriz!$AU$108,CONCATENATE(Matriz!A108,\" - P2 I2\"),\"\")","v":""},{"$f":"IF(CONCATENATE(C$12,J$3)=Matriz!$AU$153,CONCATENATE(Matriz!A153,\" - P2 I2\"),\"\")","v":""},{"$f":"IF(CONCATENATE(C$12,J$3)=Matriz!$AU$198,CONCATENATE(Matriz!A198,\" - P2 I2\"),\"\")","v":""},{"$f":"IF(CONCATENATE(C$12,O$3)=Matriz!$AU$18,CONCATENATE(Matriz!A18,\" - P2 I3\"),\"\")","v":""},{"$f":"IF(CONCATENATE(C$12,O$3)=Matriz!$AU$63,CONCATENATE(Matriz!A63,\" - P2 I3\"),\"\")","v":""},{"$f":"IF(CONCATENATE(C$12,O$3)=Matriz!$AU$108,CONCATENATE(Matriz!A108,\" - P2 I3\"),\"\")","v":""},{"$f":"IF(CONCATENATE(C$12,O$3)=Matriz!$AU$153,CONCATENATE(Matriz!A153,\" - P2 I3\"),\"\")","v":""},{"$f":"IF(CONCATENATE(C$12,O$3)=Matriz!$AU$198,CONCATENATE(Matriz!A198,\" - P2 I3\"),\"\")","v":""},{"$f":"IF(CONCATENATE(C$12,T$3)=Matriz!$AU$18,CONCATENATE(Matriz!A18,\" - P2 I4\"),\"\")","v":""},{"$f":"IF(CONCATENATE(C$12,T$3)=Matriz!$AU$63,CONCATENATE(Matriz!A63,\" - P2 I4\"),\"\")","v":""},{"$f":"IF(CONCATENATE(C$12,T$3)=Matriz!$AU$108,CONCATENATE(Matriz!A108,\" - P2 I4\"),\"\")","v":""},{"$f":"IF(CONCATENATE(C$12,T$3)=Matriz!$AU$153,CONCATENATE(Matriz!A153,\" - P2 I4\"),\"\")","v":""},{"$f":"IF(CONCATENATE(C$12,T$3)=Matriz!$AU$198,CONCATENATE(Matriz!A198,\" - P2 I4\"),\"\")","v":""},{"$f":"IF(CONCATENATE(C$12,Y$3)=Matriz!$AU$18,CONCATENATE(Matriz!A18,\" - P2 I5\"),\"\")","v":""},{"$f":"IF(CONCATENATE(C$12,Y$3)=Matriz!$AU$63,CONCATENATE(Matriz!A63,\" - P2 I5\"),\"\")","v":""},null,{"$f":"IF(CONCATENATE(C$12,Y$3)=Matriz!$AU$108,CONCATENATE(Matriz!A108,\" - P2 I5\"),\"\")","v":""},{"$f":"IF(CONCATENATE(C$12,Y$3)=Matriz!$AU$198,CONCATENATE(Matriz!A198,\" - P2 I5\"),\"\")","v":""},null,null,null,null,null,9,7,63]
[null,null,null,null,{"$f":"IF(CONCATENATE(C$12,E$3)=Matriz!$AU$27,CONCATENATE(Matriz!A27,\" - P2 I1\"),\"\")","v":""},{"$f":"IF(CONCATENATE(C$12,E$3)=Matriz!$AU$72,CONCATENATE(Matriz!A72,\" - P2 I1\"),\"\")","v":""},{"$f":"IF(CONCATENATE(C$12,E$3)=Matriz!$AU$117,CONCATENATE(Matriz!A117,\" - P2 I1\"),\"\")","v":""},{"$f":"IF(CONCATENATE(C$12,E$3)=Matriz!$AU$162,CONCATENATE(Matriz!A162,\" - P2 I1\"),\"\")","v":""},{"$f":"IF(CONCATENATE(C$12,E$3)=Matriz!$AU$207,CONCATENATE(Matriz!A207,\" - P2 I1\"),\"\")","v":""},{"$f":"IF(CONCATENATE(C$12,J$3)=Matriz!$AU$27,CONCATENATE(Matriz!A27,\" - P2 I2\"),\"\")","v":""},{"$f":"IF(CONCATENATE(C$12,J$3)=Matriz!$AU$72,CONCATENATE(Matriz!A72,\" - P2 I2\"),\"\")","v":""},{"$f":"IF(CONCATENATE(C$12,J$3)=Matriz!$AU$117,CONCATENATE(Matriz!A117,\" - P2 I2\"),\"\")","v":""},{"$f":"IF(CONCATENATE(C$12,J$3)=Matriz!$AU$162,CONCATENATE(Matriz!A162,\" - P2 I2\"),\"\")","v":""},{"$f":"IF(CONCATENATE(C$12,J$3)=Matriz!$AU$207,CONCATENATE(Matriz!A207,\" - P2 I2\"),\"\")","v":""},{"$f":"IF(CONCATENATE(C$12,O$3)=Matriz!$AU$27,CONCATENATE(Matriz!A27,\" - P2 I3\"),\"\")","v":""},{"$f":"IF(CONCATENATE(C$12,O$3)=Matriz!$AU$72,CONCATENATE(Matriz!A72,\" - P2 I3\"),\"\")","v":""},{"$f":"IF(CONCATENATE(C$12,O$3)=Matriz!$AU$117,CONCATENATE(Matriz!A117,\" - P2 I3\"),\"\")","v":""},{"$f":"IF(CONCATENATE(C$12,O$3)=Matriz!$AU$162,CONCATENATE(Matriz!A162,\" - P2 I3\"),\"\")","v":""},{"$f":"IF(CONCATENATE(C$12,O$3)=Matriz!$AU$207,CONCATENATE(Matriz!A207,\" - P2 I3\"),\"\")","v":""},{"$f":"IF(CONCATENATE(C$12,T$3)=Matriz!$AU$27,CONCATENATE(Matriz!A27,\" - P2 I4\"),\"\")","v":""},{"$f":"IF(CONCATENATE(C$12,T$3)=Matriz!$AU$72,CONCATENATE(Matriz!A72,\" - P2 I4\"),\"\")","v":""},{"$f":"IF(CONCATENATE(C$12,T$3)=Matriz!$AU$117,CONCATENATE(Matriz!A117,\" - P2 I4\"),\"\")","v":""},{"$f":"IF(CONCATENATE(C$12,T$3)=Matriz!$AU$162,CONCATENATE(Matriz!A162,\" - P2 I4\"),\"\")","v":""},{"$f":"IF(CONCATENATE(C$12,T$3)=Matriz!$AU$207,CONCATENATE(Matriz!A207,\" - P2 I4\"),\"\")","v":""},{"$f":"IF(CONCATENATE(C$12,Y$3)=Matriz!$AU$27,CONCATENATE(Matriz!A27,\" - P2 I5\"),\"\")","v":""},{"$f":"IF(CONCATENATE(C$12,Y$3)=Matriz!$AU$72,CONCATENATE(Matriz!A72,\" - P2 I5\"),\"\")","v":""},null,{"$f":"IF(CONCATENATE(C$12,Y$3)=Matriz!$AU$117,CONCATENATE(Matriz!A117,\" - P2 I5\"),\"\")","v":""},{"$f":"IF(CONCATENATE(C$12,Y$3)=Matriz!$AU$207,CONCATENATE(Matriz!A207,\" - P2 I5\"),\"\")","v":""},null,null,null,null,null,9,8,72]
[null,null,null,null,{"$f":"IF(CONCATENATE(C$12,E$3)=Matriz!$AU$36,CONCATENATE(Matriz!A36,\" - P2 I1\"),\"\")","v":""},{"$f":"IF(CONCATENATE(C$12,E$3)=Matriz!$AU$81,CONCATENATE(Matriz!A81,\" - P2 I1\"),\"\")","v":""},{"$f":"IF(CONCATENATE(C$12,E$3)=Matriz!$AU$1126,CONCATENATE(Matriz!A126,\" - P2 I1\"),\"\")","v":""},{"$f":"IF(CONCATENATE(C$12,E$3)=Matriz!$AU$171,CONCATENATE(Matriz!A171,\" - P2 I1\"),\"\")","v":""},{"$f":"IF(CONCATENATE(C$12,E$3)=Matriz!$AU$216,CONCATENATE(Matriz!A216,\" - P2 I1\"),\"\")","v":""},{"$f":"IF(CONCATENATE(C$12,J$3)=Matriz!$AU$36,CONCATENATE(Matriz!A36,\" - P2 I2\"),\"\")","v":""},{"$f":"IF(CONCATENATE(C$12,J$3)=Matriz!$AU$81,CONCATENATE(Matriz!A81,\" - P2 I2\"),\"\")","v":""},{"$f":"IF(CONCATENATE(C$12,J$3)=Matriz!$AU$126,CONCATENATE(Matriz!A126,\" - P2 I2\"),\"\")","v":""},{"$f":"IF(CONCATENATE(C$12,J$3)=Matriz!$AU$171,CONCATENATE(Matriz!A171,\" - P2 I2\"),\"\")","v":""},{"$f":"IF(CONCATENATE(C$12,J$3)=Matriz!$AU$216,CONCATENATE(Matriz!A216,\" - P2 I2\"),\"\")","v":""},{"$f":"IF(CONCATENATE(C$12,O$3)=Matriz!$AU$36,CONCATENATE(Matriz!A36,\" - P2 I3\"),\"\")","v":""},{"$f":"IF(CONCATENATE(C$12,O$3)=Matriz!$AU$81,CONCATENATE(Matriz!A81,\" - P2 I3\"),\"\")","v":""},{"$f":"IF(CONCATENATE(C$12,O$3)=Matriz!$AU$126,CONCATENATE(Matriz!A126,\" - P2 I3\"),\"\")","v":""},{"$f":"IF(CONCATENATE(C$12,O$3)=Matriz!$AU$171,CONCATENATE(Matriz!A171,\" - P2 I3\"),\"\")","v":""},{"$f":"IF(CONCATENATE(C$12,O$3)=Matriz!$AU$216,CONCATENATE(Matriz!A216,\" - P2 I3\"),\"\")","v":""},{"$f":"IF(CONCATENATE(C$12,T$3)=Matriz!$AU$36,CONCATENATE(Matriz!A36,\" - P2 I4\"),\"\")","v":""},{"$f":"IF(CONCATENATE(C$12,T$3)=Matriz!$AU$81,CONCATENATE(Matriz!A81,\" - P2 I4\"),\"\")","v":""},{"$f":"IF(CONCATENATE(C$12,T$3)=Matriz!$AU$126,CONCATENATE(Matriz!A126,\" - P2 I4\"),\"\")","v":""},{"$f":"IF(CONCATENATE(C$12,T$3)=Matriz!$AU$171,CONCATENATE(Matriz!A171,\" - P2 I4\"),\"\")","v":""},{"$f":"IF(CONCATENATE(C$12,T$3)=Matriz!$AU$216,CONCATENATE(Matriz!A216,\" - P2 I4\"),\"\")","v":""},{"$f":"IF(CONCATENATE(C$12,Y$3)=Matriz!$AU$36,CONCATENATE(Matriz!A36,\" - P2 I5\"),\"\")","v":""},{"$f":"IF(CONCATENATE(C$12,Y$3)=Matriz!$AU$81,CONCATENATE(Matriz!A81,\" - P2 I5\"),\"\")","v":""},null,{"$f":"IF(CONCATENATE(C$12,Y$3)=Matriz!$AU$126,CONCATENATE(Matriz!A126,\" - P2 I5\"),\"\")","v":""},{"$f":"IF(CONCATENATE(C$12,Y$3)=Matriz!$AU$216,CONCATENATE(Matriz!A216,\" - P2 I5\"),\"\")","v":""},null,null,null,null,null,9,9,81]
[null,null,null,null,{"$f":"IF(CONCATENATE(C$12,E$3)=Matriz!$AU$45,CONCATENATE(Matriz!A45,\" - P2 I1\"),\"\")","v":""},{"$f":"IF(CONCATENATE(C$12,E$3)=Matriz!$AU$90,CONCATENATE(Matriz!A90,\" - P2 I1\"),\"\")","v":""},{"$f":"IF(CONCATENATE(C$12,E$3)=Matriz!$AU$135,CONCATENATE(Matriz!A135,\" - P2 I1\"),\"\")","v":""},{"$f":"IF(CONCATENATE(C$12,E$3)=Matriz!$AU$180,CONCATENATE(Matriz!A180,\" - P2 I1\"),\"\")","v":""},{"$f":"IF(CONCATENATE(C$12,E$3)=Matriz!$AU$225,CONCATENATE(Matriz!A225,\" - P2 I1\"),\"\")","v":""},{"$f":"IF(CONCATENATE(C$12,J$3)=Matriz!$AU$45,CONCATENATE(Matriz!A45,\" - P2 I2\"),\"\")","v":""},{"$f":"IF(CONCATENATE(C$12,J$3)=Matriz!$AU$90,CONCATENATE(Matriz!A90,\" - P2 I2\"),\"\")","v":""},{"$f":"IF(CONCATENATE(C$12,J$3)=Matriz!$AU$135,CONCATENATE(Matriz!A135,\" - P2 I2\"),\"\")","v":""},{"$f":"IF(CONCATENATE(C$12,J$3)=Matriz!$AU$180,CONCATENATE(Matriz!A180,\" - P2 I2\"),\"\")","v":""},{"$f":"IF(CONCATENATE(C$12,J$3)=Matriz!$AU$225,CONCATENATE(Matriz!A225,\" - P2 I2\"),\"\")","v":""},{"$f":"IF(CONCATENATE(C$12,O$3)=Matriz!$AU$45,CONCATENATE(Matriz!A45,\" - P2 I3\"),\"\")","v":""},{"$f":"IF(CONCATENATE(C$12,O$3)=Matriz!$AU$90,CONCATENATE(Matriz!A90,\" - P2 I3\"),\"\")","v":""},{"$f":"IF(CONCATENATE(C$12,O$3)=Matriz!$AU$135,CONCATENATE(Matriz!A135,\" - P2 I3\"),\"\")","v":""},{"$f":"IF(CONCATENATE(C$12,O$3)=Matriz!$AU$180,CONCATENATE(Matriz!A180,\" - P2 I3\"),\"\")","v":""},{"$f":"IF(CONCATENATE(C$12,O$3)=Matriz!$AU$225,CONCATENATE(Matriz!A225,\" - P2 I3\"),\"\")","v":""},{"$f":"IF(CONCATENATE(C$12,T$3)=Matriz!$AU$45,CONCATENATE(Matriz!A45,\" - P2 I4\"),\"\")","v":""},{"$f":"IF(CONCATENATE(C$12,T$3)=Matriz!$AU$90,CONCATENATE(Matriz!A90,\" - P2 I4\"),\"\")","v":""},{"$f":"IF(CONCATENATE(C$12,T$3)=Matriz!$AU$135,CONCATENATE(Matriz!A135,\" - P2 I4\"),\"\")","v":""},{"$f":"IF(CONCATENATE(C$12,T$3)=Matriz!$AU$180,CONCATENATE(Matriz!A180,\" - P2 I4\"),\"\")","v":""},{"$f":"IF(CONCATENATE(C$12,T$3)=Matriz!$AU$225,CONCATENATE(Matriz!A225,\" - P2 I4\"),\"\")","v":""},{"$f":"IF(CONCATENATE(C$12,Y$3)=Matriz!$AU$45,CONCATENATE(Matriz!A45,\" - P2 I5\"),\"\")","v":""},{"$f":"IF(CONCATENATE(C$12,Y$3)=Matriz!$AU$90,CONCATENATE(Matriz!A90,\" - P2 I5\"),\"\")","v":""},null,{"$f":"IF(CONCATENATE(C$12,Y$3)=Matriz!$AU$135,CONCATENATE(Matriz!A135,\" - P2 I5\"),\"\")","v":""},{"$f":"IF(CONCATENATE(C$12,Y$3)=Matriz!$AU$225,CONCATENATE(Matriz!A225,\" - P2 I5\"),\"\")","v":""},null,null,null,null,null,9,10,90]
[null,null,null,null,{"$f":"IF(CONCATENATE(C$17,E$3)=Matriz!$AU$9,CONCATENATE(Matriz!A9,\" - P3 I1\"),\"\")","v":""},{"$f":"IF(CONCATENATE(C$17,E$3)=Matriz!$AU$54,CONCATENATE(Matriz!A54,\" - P3 I1\"),\"\")","v":""},{"$f":"IF(CONCATENATE(C$17,E$3)=Matriz!$AU$99,CONCATENATE(Matriz!A99,\" - P3 I1\"),\"\")","v":""},{"$f":"IF(CONCATENATE(C$17,E$3)=Matriz!$AU$144,CONCATENATE(Matriz!A144,\" - P3 I1\"),\"\")","v":""},{"$f":"IF(CONCATENATE(C$17,E$3)=Matriz!$AU$189,CONCATENATE(Matriz!A189,\" - P3 I1\"),\"\")","v":""},{"$f":"IF(CONCATENATE(C$17,J$3)=Matriz!$AU$9,CONCATENATE(Matriz!A9,\" - P3 I2\"),\"\")","v":""},{"$f":"IF(CONCATENATE(C$17,J$3)=Matriz!$AU$54,CONCATENATE(Matriz!A54,\" - P3 I2\"),\"\")","v":""},{"$f":"IF(CONCATENATE(C$17,J$3)=Matriz!$AU$99,CONCATENATE(Matriz!A99,\" - P3 I2\"),\"\")","v":""},{"$f":"IF(CONCATENATE(C$17,J$3)=Matriz!$AU$144,CONCATENATE(Matriz!A144,\" - P3 I2\"),\"\")","v":""},{"$f":"IF(CONCATENATE(C$17,J$3)=Matriz!$AU$189,CONCATENATE(Matriz!A189,\" - P3 I2\"),\"\")","v":""},{"$f":"IF(CONCATENATE(C$17,O$3)=Matriz!$AU$9,CONCATENATE(Matriz!A9,\" - P3 I3\"),\"\")","v":""},{"$f":"IF(CONCATENATE(C$17,O$3)=Matriz!$AU$54,CONCATENATE(Matriz!A54,\" - P3 I3\"),\"\")","v":""},{"$f":"IF(CONCATENATE(C$17,O$3)=Matriz!$AU$99,CONCATENATE(Matriz!A99,\" - P3 I3\"),\"\")","v":""},{"$f":"IF(CONCATENATE(C$17,O$3)=Matriz!$AU$144,CONCATENATE(Matriz!A144,\" - P3 I3\"),\"\")","v":""},{"$f":"IF(CONCATENATE(C$17,O$3)=Matriz!$AU$189,CONCATENATE(Matriz!A189,\" - P3 I3\"),\"\")","v":""},{"$f":"IF(CONCATENATE(C$17,T$3)=Matriz!$AU$9,CONCATENATE(Matriz!A9,\" - P3 I4\"),\"\")","v":""},{"$f":"IF(CONCATENATE(C$17,T$3)=Matriz!$AU$54,CONCATENATE(Matriz!A54,\" - P3 I4\"),\"\")","v":""},{"$f":"IF(CONCATENATE(C$17,T$3)=Matriz!$AU$99,CONCATENATE(Matriz!A99,\" - P3 I4\"),\"\")","v":""},{"$f":"IF(CONCATENATE(C$17,T$3)=Matriz!$AU$144,CONCATENATE(Matriz!A144,\" - P3 I4\"),\"\")","v":""},{"$f":"IF(CONCATENATE(C$17,T$3)=Matriz!$AU$189,CONCATENATE(Matriz!A189,\" - P3 I4\"),\"\")","v":""},{"$f":"IF(CONCATENATE(C$17,Y$3)=Matriz!$AU$9,CONCATENATE(Matriz!A9,\" - P3 I5\"),\"\")","v":""},{"$f":"IF(CONCATENATE(C$17,Y$3)=Matriz!$AU$54,CONCATENATE(Matriz!A54,\" - P3 I5\"),\"\")","v":""},{"$f":"IF(CONCATENATE(C$17,Y$3)=Matriz!$AU$99,CONCATENATE(Matriz!A99,\" - P3 I5\"),\"\")","v":""},{"$f":"IF(CONCATENATE(C$17,Y$3)=Matriz!$AU$144,CONCATENATE(Matriz!A144,\" - P3 I5\"),\"\")","v":""},{"$f":"IF(CONCATENATE(C$17,Y$3)=Matriz!$AU$189,CONCATENATE(Matriz!A189,\" - P3 I5\"),\"\")","v":""},null,null,null,null,null,9,11,99]
[null,null,3,"POSIBLE",{"$f":"IF(CONCATENATE(C$17,E$3)=Matriz!$AU$18,CONCATENATE(Matriz!A18,\" - P3 I1\"),\"\")","v":""},{"$f":"IF(CONCATENATE(C$17,E$3)=Matriz!$AU$63,CONCATENATE(Matriz!A63,\" - P3 I1\"),\"\")","v":""},{"$f":"IF(CONCATENATE(C$17,E$3)=Matriz!$AU$108,CONCATENATE(Matriz!A108,\" - P3 I1\"),\"\")","v":""},{"$f":"IF(CONCATENATE(C$17,E$3)=Matriz!$AU$153,CONCATENATE(Matriz!A153,\" - P3 I1\"),\"\")","v":""},{"$f":"IF(CONCATENATE(C$17,E$3)=Matriz!$AU$198,CONCATENATE(Matriz!A198,\" - P3 I1\"),\"\")","v":""},{"$f":"IF(CONCATENATE(C$17,J$3)=Matriz!$AU$18,CONCATENATE(Matriz!A18,\" - P3 I2\"),\"\")","v":""},{"$f":"IF(CONCATENATE(C$17,J$3)=Matriz!$AU$63,CONCATENATE(Matriz!A63,\" - P3 I2\"),\"\")","v":""},{"$f":"IF(CONCATENATE(C$17,J$3)=Matriz!$AU$108,CONCATENATE(Matriz!A108,\" - P3 I2\"),\"\")","v":""},{"$f":"IF(CONCATENATE(C$17,J$3)=Matriz!$AU$153,CONCATENATE(Matriz!A153,\" - P3 I2\"),\"\")","v":""},{"$f":"IF(CONCATENATE(C$17,J$3)=Matriz!$AU$198,CONCATENATE(Matriz!A198,\" - P3 I2\"),\"\")","v":""},{"$f":"IF(CONCATENATE(C$17,O$3)=Matriz!$AU$18,CONCATENATE(Matriz!A18,\" - P3 I3\"),\"\")","v":""},{"$f":"IF(CONCATENATE(C$17,O$3)=Matriz!$AU$63,CONCATENATE(Matriz!A63,\" - P3 I3\"),\"\")","v":""},{"$f":"IF(CONCATENATE(C$17,O$3)=Matriz!$AU$108,CONCATENATE(Matriz!A108,\" - P3 I3\"),\"\")","v":""},{"$f":"IF(CONCATENATE(C$17,O$3)=Matriz!$AU$153,CONCATENATE(Matriz!A153,\" - P3 I3\"),\"\")","v":""},{"$f":"IF(CONCATENATE(C$17,O$3)=Matriz!$AU$198,CONCATENATE(Matriz!A198,\" - P3 I3\"),\"\")","v":""},{"$f":"IF(CONCATENATE(C$17,T$3)=Matriz!$AU$18,CONCATENATE(Matriz!A18,\" - P3 I4\"),\"\")","v":""},{"$f":"IF(CONCATENATE(C$17,T$3)=Matriz!$AU$63,CONCATENATE(Matriz!A63,\" - P3 I4\"),\"\")","v":""},{"$f":"IF(CONCATENATE(C$17,T$3)=Matriz!$AU$108,CONCATENATE(Matriz!A108,\" - P3 I4\"),\"\")","v":""},{"$f":"IF(CONCATENATE(C$17,T$3)=Matriz!$AU$153,CONCATENATE(Matriz!A153,\" - P3 I4\"),\"\")","v":""},{"$f":"IF(CONCATENATE(C$17,T$3)=Matriz!$AU$198,CONCATENATE(Matriz!A198,\" - P3 I4\"),\"\")","v":""},{"$f":"IF(CONCATENATE(C$17,Y$3)=Matriz!$AU$18,CONCATENATE(Matriz!A18,\" - P3 I5\"),\"\")","v":""},{"$f":"IF(CONCATENATE(C$17,Y$3)=Matriz!$AU$63,CONCATENATE(Matriz!A63,\" - P3 I5\"),\"\")","v":""},{"$f":"IF(CONCATENATE(C$17,Y$3)=Matriz!$AU$108,CONCATENATE(Matriz!A108,\" - P3 I5\"),\"\")","v":""},{"$f":"IF(CONCATENATE(C$17,Y$3)=Matriz!$AU$153,CONCATENATE(Matriz!A153,\" - P3 I5\"),\"\")","v":""},{"$f":"IF(CONCATENATE(C$17,Y$3)=Matriz!$AU$198,CONCATENATE(Matriz!A198,\" - P3 I5\"),\"\")","v":""},null,null,null,null,null,9,12,108]
[null,null,null,null,{"$f":"IF(CONCATENATE(C$17,E$3)=Matriz!$AU$27,CONCATENATE(Matriz!A27,\" - P3 I1\"),\"\")","v":""},{"$f":"IF(CONCATENATE(C$17,E$3)=Matriz!$AU$72,CONCATENATE(Matriz!A72,\" - P3 I1\"),\"\")","v":""},{"$f":"IF(CONCATENATE(C$17,E$3)=Matriz!$AU$117,CONCATENATE(Matriz!A117,\" - P3 I1\"),\"\")","v":""},{"$f":"IF(CONCATENATE(C$17,E$3)=Matriz!$AU$162,CONCATENATE(Matriz!A162,\" - P3 I1\"),\"\")","v":""},{"$f":"IF(CONCATENATE(C$17,E$3)=Matriz!$AU$207,CONCATENATE(Matriz!A207,\" - P3 I1\"),\"\")","v":""},{"$f":"IF(CONCATENATE(C$17,J$3)=Matriz!$AU$27,CONCATENATE(Matriz!A27,\" - P3 I2\"),\"\")","v":""},{"$f":"IF(CONCATENATE(C$17,J$3)=Matriz!$AU$72,CONCATENATE(Matriz!A72,\" - P3 I2\"),\"\")","v":""},{"$f":"IF(CONCATENATE(C$17,J$3)=Matriz!$AU$117,CONCATENATE(Matriz!A117,\" - P3 I2\"),\"\")","v":""},{"$f":"IF(CONCATENATE(C$17,J$3)=Matriz!$AU$162,CONCATENATE(Matriz!A162,\" - P3 I2\"),\"\")","v":""},{"$f":"IF(CONCATENATE(C$17,J$3)=Matriz!$AU$207,CONCATENATE(Matriz!A207,\" - P3 I2\"),\"\")","v":""},{"$f":"IF(CONCATENATE(C$17,O$3)=Matriz!$AU$27,CONCATENATE(Matriz!A27,\" - P3 I3\"),\"\")","v":""},{"$f":"IF(CONCATENATE(C$17,O$3)=Matriz!$AU$72,CONCATENATE(Matriz!A72,\" - P3 I3\"),\"\")","v":""},{"$f":"IF(CONCATENATE(C$17,O$3)=Matriz!$AU$117,CONCATENATE(Matriz!A117,\" - P3 I3\"),\"\")","v":""},{"$f":"IF(CONCATENATE(C$17,O$3)=Matriz!$AU$162,CONCATENATE(Matriz!A162,\" - P3 I3\"),\"\")","v":""},{"$f":"IF(CONCATENATE(C$17,O$3)=Matriz!$AU$207,CONCATENATE(Matriz!A207,\" - P3 I3\"),\"\")","v":""},{"$f":"IF(CONCATENATE(C$17,T$3)=Matriz!$AU$27,CONCATENATE(Matriz!A27,\" - P3 I4\"),\"\")","v":""},{"$f":"IF(CONCATENATE(C$17,T$3)=Matriz!$AU$72,CONCATENATE(Matriz!A72,\" - P3 I4\"),\"\")","v":""},{"$f":"IF(CONCATENATE(C$17,T$3)=Matriz!$AU$117,CONCATENATE(Matriz!A117,\" - P3 I4\"),\"\")","v":""},{"$f":"IF(CONCATENATE(C$17,T$3)=Matriz!$AU$162,CONCATENATE(Matriz!A162,\" - P3 I4\"),\"\")","v":""},{"$f":"IF(CONCATENATE(C$17,T$3)=Matriz!$AU$207,CONCATENATE(Matriz!A207,\" - P3 I4\"),\"\")","v":""},{"$f":"IF(CONCATENATE(C$17,Y$3)=Matriz!$AU$27,CONCATENATE(Matriz!A27,\" - P3 I5\"),\"\")","v":""},{"$f":"IF(CONCATENATE(C$17,Y$3)=Matriz!$AU$72,CONCATENATE(Matriz!A72,\" - P3 I5\"),\"\")","v":""},{"$f":"IF(CONCATENATE(C$17,Y$3)=Matriz!$AU$117,CONCATENATE(Matriz!A117,\" - P3 I5\"),\"\")","v":""},{"$f":"IF(CONCATENATE(C$17,Y$3)=Matriz!$AU$162,CONCATENATE(Matriz!A162,\" - P3 I5\"),\"\")","v":""},{"$f":"IF(CONCATENATE(C$17,Y$3)=Matriz!$AU$207,CONCATENATE(Matriz!A207,\" - P3 I5\"),\"\")","v":""},null,null,null,null,null,9,13,117]
[null,null,null,null,{"$f":"IF(CONCATENATE(C$17,E$3)=Matriz!$AU$36,CONCATENATE(Matriz!A36,\" - P3 I1\"),\"\")","v":""},{"$f":"IF(CONCATENATE(C$17,E$3)=Matriz!$AU$81,CONCATENATE(Matriz!A81,\" - P3 I1\"),\"\")","v":""},{"$f":"IF(CONCATENATE(C$17,E$3)=Matriz!$AU$126,CONCATENATE(Matriz!A126,\" - P3 I1\"),\"\")","v":""},{"$f":"IF(CONCATENATE(C$17,E$3)=Matriz!$AU$171,CONCATENATE(Matriz!A171,\" - P3 I1\"),\"\")","v":""},{"$f":"IF(CONCATENATE(C$17,E$3)=Matriz!$AU$216,CONCATENATE(Matriz!A216,\" - P3 I1\"),\"\")","v":""},{"$f":"IF(CONCATENATE(C$17,J$3)=Matriz!$AU$36,CONCATENATE(Matriz!A36,\" - P3 I2\"),\"\")","v":""},{"$f":"IF(CONCATENATE(C$17,J$3)=Matriz!$AU$81,CONCATENATE(Matriz!A81,\" - P3 I2\"),\"\")","v":""},{"$f":"IF(CONCATENATE(C$17,J$3)=Matriz!$AU$126,CONCATENATE(Matriz!A126,\" - P3 I2\"),\"\")","v":""},{"$f":"IF(CONCATENATE(C$17,J$3)=Matriz!$AU$171,CONCATENATE(Matriz!A171,\" - P3 I2\"),\"\")","v":""},{"$f":"IF(CONCATENATE(C$17,J$3)=Matriz!$AU$216,CONCATENATE(Matriz!A216,\" - P3 I2\"),\"\")","v":""},{"$f":"IF(CONCATENATE(C$17,O$3)=Matriz!$AU$36,CONCATENATE(Matriz!A36,\" - P3 I3\"),\"\")","v":""},{"$f":"IF(CONCATENATE(C$17,O$3)=Matriz!$AU$81,CONCATENATE(Matriz!A81,\" - P3 I3\"),\"\")","v":""},{"$f":"IF(CONCATENATE(C$17,O$3)=Matriz!$AU$126,CONCATENATE(Matriz!A126,\" - P3 I3\"),\"\")","v":""},{"$f":"IF(CONCATENATE(C$17,O$3)=Matriz!$AU$171,CONCATENATE(Matriz!A171,\" - P3 I3\"),\"\")","v":""},{"$f":"IF(CONCATENATE(C$17,O$3)=Matriz!$AU$216,CONCATENATE(Matriz!A216,\" - P3 I3\"),\"\")","v":""},{"$f":"IF(CONCATENATE(C$17,T$3)=Matriz!$AU$36,CONCATENATE(Matriz!A36,\" - P3 I4\"),\"\")","v":""},{"$f":"IF(CONCATENATE(C$17,T$3)=Matriz!$AU$81,CONCATENATE(Matriz!A81,\" - P3 I4\"),\"\")","v":""},{"$f":"IF(CONCATENATE(C$17,T$3)=Matriz!$AU$126,CONCATENATE(Matriz!A126,\" - P3 I4\"),\"\")","v":""},{"$f":"IF(CONCATENATE(C$17,T$3)=Matriz!$AU$171,CONCATENATE(Matriz!A171,\" - P3 I4\"),\"\")","v":""},{"$f":"IF(CONCATENATE(C$17,T$3)=Matriz!$AU$216,CONCATENATE(Matriz!A216,\" - P3 I4\"),\"\")","v":""},{"$f":"IF(CONCATENATE(C$17,Y$3)=Matriz!$AU$36,CONCATENATE(Matriz!A36,\" - P3 I5\"),\"\")","v":""},{"$f":"IF(CONCATENATE(C$17,Y$3)=Matriz!$AU$81,CONCATENATE(Matriz!A81,\" - P3 I5\"),\"\")","v":""},{"$f":"IF(CONCATENATE(C$17,Y$3)=Matriz!$AU$126,CONCATENATE(Matriz!A126,\" - P3 I5\"),\"\")","v":""},{"$f":"IF(CONCATENATE(C$17,Y$3)=Matriz!$AU$171,CONCATENATE(Matriz!A171,\" - P3 I5\"),\"\")","v":""},{"$f":"IF(CONCATENATE(C$17,Y$3)=Matriz!$AU$216,CONCATENATE(Matriz!A216,\" - P3 I5\"),\"\")","v":""},null,null,null,null,null,9,14,126]
[null,null,null,null,{"$f":"IF(CONCATENATE(C$17,E$3)=Matriz!$AU$45,CONCATENATE(Matriz!A45,\" - P3 I1\"),\"\")","v":""},{"$f":"IF(CONCATENATE(C$17,E$3)=Matriz!$AU$90,CONCATENATE(Matriz!A90,\" - P3 I1\"),\"\")","v":""},{"$f":"IF(CONCATENATE(C$17,E$3)=Matriz!$AU$135,CONCATENATE(Matriz!A135,\" - P3 I1\"),\"\")","v":""},{"$f":"IF(CONCATENATE(C$17,E$3)=Matriz!$AU$180,CONCATENATE(Matriz!A180,\" - P3 I1\"),\"\")","v":""},{"$f":"IF(CONCATENATE(C$17,E$3)=Matriz!$AU$225,CONCATENATE(Matriz!A225,\" - P3 I1\"),\"\")","v":""},{"$f":"IF(CONCATENATE(C$17,J$3)=Matriz!$AU$45,CONCATENATE(Matriz!A45,\" - P3 I2\"),\"\")","v":""},{"$f":"IF(CONCATENATE(C$17,J$3)=Matriz!$AU$90,CONCATENATE(Matriz!A90,\" - P3 I2\"),\"\")","v":""},{"$f":"IF(CONCATENATE(C$17,J$3)=Matriz!$AU$135,CONCATENATE(Matriz!A135,\" - P3 I2\"),\"\")","v":""},{"$f":"IF(CONCATENATE(C$17,J$3)=Matriz!$AU$180,CONCATENATE(Matriz!A180,\" - P3 I2\"),\"\")","v":""},{"$f":"IF(CONCATENATE(C$17,J$3)=Matriz!$AU$225,CONCATENATE(Matriz!A225,\" - P3 I2\"),\"\")","v":""},{"$f":"IF(CONCATENATE(C$17,O$3)=Matriz!$AU$45,CONCATENATE(Matriz!A45,\" - P3 I3\"),\"\")","v":""},{"$f":"IF(CONCATENATE(C$17,O$3)=Matriz!$AU$90,CONCATENATE(Matriz!A90,\" - P3 I3\"),\"\")","v":""},{"$f":"IF(CONCATENATE(C$17,O$3)=Matriz!$AU$135,CONCATENATE(Matriz!A135,\" - P3 I3\"),\"\")","v":""},{"$f":"IF(CONCATENATE(C$17,O$3)=Matriz!$AU$180,CONCATENATE(Matriz!A180,\" - P3 I3\"),\"\")","v":""},{"$f":"IF(CONCATENATE(C$17,O$3)=Matriz!$AU$225,CONCATENATE(Matriz!A225,\" - P3 I3\"),\"\")","v":""},{"$f":"IF(CONCATENATE(C$17,T$3)=Matriz!$AU$45,CONCATENATE(Matriz!A45,\" - P3 I4\"),\"\")","v":""},{"$f":"IF(CONCATENATE(C$17,T$3)=Matriz!$AU$90,CONCATENATE(Matriz!A90,\" - P3 I4\"),\"\")","v":""},{"$f":"IF(CONCATENATE(C$17,T$3)=Matriz!$AU$135,CONCATENATE(Matriz!A135,\" - P3 I4\"),\"\")","v":""},{"$f":"IF(CONCATENATE(C$17,T$3)=Matriz!$AU$180,CONCATENATE(Matriz!A180,\" - P3 I4\"),\"\")","v":""},{"$f":"IF(CONCATENATE(C$17,T$3)=Matriz!$AU$225,CONCATENATE(Matriz!A225,\" - P3 I4\"),\"\")","v":""},{"$f":"IF(CONCATENATE(C$17,Y$3)=Matriz!$AU$45,CONCATENATE(Matriz!A45,\" - P3 I5\"),\"\")","v":""},{"$f":"IF(CONCATENATE(C$17,Y$3)=Matriz!$AU$90,CONCATENATE(Matriz!A90,\" - P3 I5\"),\"\")","v":""},{"$f":"IF(CONCATENATE(C$17,Y$3)=Matriz!$AU$135,CONCATENATE(Matriz!A135,\" - P3 I5\"),\"\")","v":""},{"$f":"IF(CONCATENATE(C$17,Y$3)=Matriz!$AU$180,CONCATENATE(Matriz!A180,\" - P3 I5\"),\"\")","v":""},{"$f":"IF(CONCATENATE(C$17,Y$3)=Matriz!$AU$225,CONCATENATE(Matriz!A225,\" - P3 I5\"),\"\")","v":""},null,null,null,null,null,9,15,135]
[null,null,null,null,{"$f":"IF(CONCATENATE(C$22,E$3)=Matriz!$AU$9,CONCATENATE(Matriz!A9,\" - P4 I1\"),\"\")","v":""},{"$f":"IF(CONCATENATE(C$22,E$3)=Matriz!$AU$54,CONCATENATE(Matriz!A54,\" - P4 I1\"),\"\")","v":""},{"$f":"IF(CONCATENATE(C$22,E$3)=Matriz!$AU$99,CONCATENATE(Matriz!A99,\" - P4 I1\"),\"\")","v":""},{"$f":"IF(CONCATENATE(C$22,E$3)=Matriz!$AU$144,CONCATENATE(Matriz!A144,\" - P4 I1\"),\"\")","v":""},{"$f":"IF(CONCATENATE(C$22,E$3)=Matriz!$AU$189,CONCATENATE(Matriz!A189,\" - P4 I1\"),\"\")","v":""},{"$f":"IF(CONCATENATE(C$22,J$3)=Matriz!$AU$9,CONCATENATE(Matriz!A9,\" - P4 I2\"),\"\")","v":""},{"$f":"IF(CONCATENATE(C$22,J$3)=Matriz!$AU$54,CONCATENATE(Matriz!A54,\" - P4 I2\"),\"\")","v":""},{"$f":"IF(CONCATENATE(C$22,J$3)=Matriz!$AU$99,CONCATENATE(Matriz!A99,\" - P4 I2\"),\"\")","v":""},{"$f":"IF(CONCATENATE(C$22,J$3)=Matriz!$AU$144,CONCATENATE(Matriz!A144,\" - P4 I2\"),\"\")","v":""},{"$f":"IF(CONCATENATE(C$22,J$3)=Matriz!$AU$189,CONCATENATE(Matriz!A189,\" - P4 I2\"),\"\")","v":""},{"$f":"IF(CONCATENATE(C$22,O$3)=Matriz!$AU$9,CONCATENATE(Matriz!A9,\" - P4 I3\"),\"\")","v":""},{"$f":"IF(CONCATENATE(C$22,O$3)=Matriz!$AU$54,CONCATENATE(Matriz!A54,\" - P4 I3\"),\"\")","v":""},{"$f":"IF(CONCATENATE(D$22,P$3)=Matriz!$AU$99,CONCATENATE(Matriz!B99,\" - P4 I3\"),\"\")","v":""},{"$f":"IF(CONCATENATE(D$22,P$3)=Matriz!$AU$144,CONCATENATE(Matriz!B144,\" - P4 I3\"),\"\")","v":""},{"$f":"IF(CONCATENATE(D$22,P$3)=Matriz!$AU$189,CONCATENATE(Matriz!B189,\" - P4 I3\"),\"\")","v":""},{"$f":"IF(CONCATENATE(C$22,T$3)=Matriz!$AU$9,CONCATENATE(Matriz!A9,\" - P4 I4\"),\"\")","v":""},{"$f":"IF(CONCATENATE(C$22,T$3)=Matriz!$AU$54,CONCATENATE(Matriz!A54,\" - P4 I4\"),\"\")","v":""},{"$f":"IF(CONCATENATE(C$22,T$3)=Matriz!$AU$99,CONCATENATE(Matriz!A99,\" - P4 I4\"),\"\")","v":""},{"$f":"IF(CONCATENATE(C$22,T$3)=Matriz!$AU$144,CONCATENATE(Matriz!A144,\" - P4 I4\"),\"\")","v":""},{"$f":"IF(CONCATENATE(C$22,T$3)=Matriz!$AU$189,CONCATENATE(Matriz!A189,\" - P4 I4\"),\"\")","v":""},{"$f":"IF(CONCATENATE(C$22,Y$3)=Matriz!$AU$9,CONCATENATE(Matriz!A9,\" - P4 I5\"),\"\")","v":""},{"$f":"IF(CONCATENATE(C$22,Y$3)=Matriz!$AU$54,CONCATENATE(Matriz!A54,\" - P4 I5\"),\"\")","v":""},{"$f":"IF(CONCATENATE(C$22,Y$3)=Matriz!$AU$99,CONCATENATE(Matriz!A99,\" - P4 I5\"),\"\")","v":""},{"$f":"IF(CONCATENATE(C$22,Y$3)=Matriz!$AU$144,CONCATENATE(Matriz!A144,\" - P4 I5\"),\"\")","v":""},{"$f":"IF(CONCATENATE(C$22,Y$3)=Matriz!$AU$189,CONCATENATE(Matriz!A189,\" - P4 I5\"),\"\")","v":""},null,null,null,null,null,9,16,144]
[null,null,2,"IMPROBABLE",{"$f":"IF(CONCATENATE(C$22,E$3)=Matriz!$AU$18,CONCATENATE(Matriz!A18,\" - P4 I1\"),\"\")","v":""},{"$f":"IF(CONCATENATE(C$22,E$3)=Matriz!$AU$63,CONCATENATE(Matriz!A63,\" - P4 I1\"),\"\")","v":""},{"$f":"IF(CONCATENATE(C$22,E$3)=Matriz!$AU$108,CONCATENATE(Matriz!A108,\" - P4 I1\"),\"\")","v":""},{"$f":"IF(CONCATENATE(C$22,E$3)=Matriz!$AU$153,CONCATENATE(Matriz!A153,\" - P4 I1\"),\"\")","v":""},{"$f":"IF(CONCATENATE(C$22,E$3)=Matriz!$AU$198,CONCATENATE(Matriz!A198,\" - P4 I1\"),\"\")","v":""},{"$f":"IF(CONCATENATE(C$22,J$3)=Matriz!$AU$18,CONCATENATE(Matriz!A18,\" - P4 I2\"),\"\")","v":""},{"$f":"IF(CONCATENATE(C$22,J$3)=Matriz!$AU$63,CONCATENATE(Matriz!A63,\" - P4 I2\"),\"\")","v":""},{"$f":"IF(CONCATENATE(C$22,J$3)=Matriz!$AU$108,CONCATENATE(Matriz!A108,\" - P4 I2\"),\"\")","v":""},{"$f":"IF(CONCATENATE(C$22,J$3)=Matriz!$AU$153,CONCATENATE(Matriz!A153,\" - P4 I2\"),\"\")","v":""},{"$f":"IF(CONCATENATE(C$22,J$3)=Matriz!$AU$198,CONCATENATE(Matriz!A198,\" - P4 I2\"),\"\")","v":""},{"$f":"IF(CONCATENATE(C$22,O$3)=Matriz!$AU$18,CONCATENATE(Matriz!A18,\" - P4 I3\"),\"\")","v":""},{"$f":"IF(CONCATENATE(C$22,O$3)=Matriz!$AU$63,CONCATENATE(Matriz!A63,\" - P4 I3\"),\"\")","v":""},{"$f":"IF(CONCATENATE(D$22,P$3)=Matriz!$AU$108,CONCATENATE(Matriz!B108,\" - P4 I3\"),\"\")","v":""},{"$f":"IF(CONCATENATE(D$22,P$3)=Matriz!$AU$153,CONCATENATE(Matriz!B153,\" - P4 I3\"),\"\")","v":""},{"$f":"IF(CONCATENATE(D$22,P$3)=Matriz!$AU$198,CONCATENATE(Matriz!B198,\" - P4 I3\"),\"\")","v":""},{"$f":"IF(CONCATENATE(C$22,T$3)=Matriz!$AU$18,CONCATENATE(Matriz!A18,\" - P4 I4\"),\"\")","v":""},{"$f":"IF(CONCATENATE(C$22,T$3)=Matriz!$AU$63,CONCATENATE(Matriz!A63,\" - P4 I4\"),\"\")","v":""},{"$f":"IF(CONCATENATE(C$22,T$3)=Matriz!$AU$108,CONCATENATE(Matriz!A108,\" - P4 I4\"),\"\")","v":""},{"$f":"IF(CONCATENATE(C$22,T$3)=Matriz!$AU$153,CONCATENATE(Matriz!A153,\" - P4 I4\"),\"\")","v":""},{"$f":"IF(CONCATENATE(C$22,T$3)=Matriz!$AU$198,CONCATENATE(Matriz!A198,\" - P4 I4\"),\"\")","v":""},{"$f":"IF(CONCATENATE(C$22,Y$3)=Matriz!$AU$18,CONCATENATE(Matriz!A18,\" - P4 I5\"),\"\")","v":""},{"$f":"IF(CONCATENATE(C$22,Y$3)=Matriz!$AU$63,CONCATENATE(Matriz!A63,\" - P4 I5\"),\"\")","v":""},{"$f":"IF(CONCATENATE(C$22,Y$3)=Matriz!$AU$108,CONCATENATE(Matriz!A108,\" - P4 I5\"),\"\")","v":""},{"$f":"IF(CONCATENATE(C$22,Y$3)=Matriz!$AU$153,CONCATENATE(Matriz!A153,\" - P4 I5\"),\"\")","v":""},{"$f":"IF(CONCATENATE(C$22,Y$3)=Matriz!$AU$198,CONCATENATE(Matriz!A198,\" - P4 I5\"),\"\")","v":""},null,null,null,null,null,9,17,153]
[null,null,null,null,{"$f":"IF(CONCATENATE(C$22,E$3)=Matriz!$AU$27,CONCATENATE(Matriz!A27,\" - P4 I1\"),\"\")","v":""},{"$f":"IF(CONCATENATE(C$22,E$3)=Matriz!$AU$72,CONCATENATE(Matriz!A72,\" - P4 I1\"),\"\")","v":""},{"$f":"IF(CONCATENATE(C$22,E$3)=Matriz!$AU$117,CONCATENATE(Matriz!A117,\" - P4 I1\"),\"\")","v":""},{"$f":"IF(CONCATENATE(C$22,E$3)=Matriz!$AU$162,CONCATENATE(Matriz!A162,\" - P4 I1\"),\"\")","v":""},{"$f":"IF(CONCATENATE(C$22,E$3)=Matriz!$AU$207,CONCATENATE(Matriz!A207,\" - P4 I1\"),\"\")","v":""},{"$f":"IF(CONCATENATE(C$22,J$3)=Matriz!$AU$27,CONCATENATE(Matriz!A27,\" - P4 I2\"),\"\")","v":""},{"$f":"IF(CONCATENATE(C$22,J$3)=Matriz!$AU$72,CONCATENATE(Matriz!A72,\" - P4 I2\"),\"\")","v":""},{"$f":"IF(CONCATENATE(C$22,J$3)=Matriz!$AU$117,CONCATENATE(Matriz!A117,\" - P4 I2\"),\"\")","v":""},{"$f":"IF(CONCATENATE(C$22,J$3)=Matriz!$AU$162,CONCATENATE(Matriz!A162,\" - P4 I2\"),\"\")","v":""},{"$f":"IF(CONCATENATE(C$22,J$3)=Matriz!$AU$207,CONCATENATE(Matriz!A207,\" - P4 I2\"),\"\")","v":""},{"$f":"IF(CONCATENATE(C$22,O$3)=Matriz!$AU$27,CONCATENATE(Matriz!A27,\" - P4 I3\"),\"\")","v":""},{"$f":"IF(CONCATENATE(C$22,O$3)=Matriz!$AU$72,CONCATENATE(Matriz!A72,\" - P4 I3\"),\"\")","v":""},{"$f":"IF(CONCATENATE(D$22,P$3)=Matriz!$AU$117,CONCATENATE(Matriz!B117,\" - P4 I3\"),\"\")","v":""},{"$f":"IF(CONCATENATE(D$22,P$3)=Matriz!$AU$162,CONCATENATE(Matriz!B162,\" - P4 I3\"),\"\")","v":""},{"$f":"IF(CONCATENATE(D$22,P$3)=Matriz!$AU$207,CONCATENATE(Matriz!B207,\" - P4 I3\"),\"\")","v":""},{"$f":"IF(CONCATENATE(C$22,T$3)=Matriz!$AU$27,CONCATENATE(Matriz!A27,\" - P4 I4\"),\"\")","v":""},{"$f":"IF(CONCATENATE(C$22,T$3)=Matriz!$AU$72,CONCATENATE(Matriz!A72,\" - P4 I4\"),\"\")","v":""},{"$f":"IF(CONCATENATE(C$22,T$3)=Matriz!$AU$117,CONCATENATE(Matriz!A117,\" - P4 I4\"),\"\")","v":""},{"$f":"IF(CONCATENATE(C$22,T$3)=Matriz!$AU$162,CONCATENATE(Matriz!A162,\" - P4 I4\"),\"\")","v":""},{"$f":"IF(CONCATENATE(C$22,T$3)=Matriz!$AU$207,CONCATENATE(Matriz!A207,\" - P4 I4\"),\"\")","v":""},{"$f":"IF(CONCATENATE(C$22,Y$3)=Matriz!$AU$27,CONCATENATE(Matriz!A27,\" - P4 I5\"),\"\")","v":""},{"$f":"IF(CONCATENATE(C$22,Y$3)=Matriz!$AU$72,CONCATENATE(Matriz!A72,\" - P4 I5\"),\"\")","v":""},{"$f":"IF(CONCATENATE(C$22,Y$3)=Matriz!$AU$117,CONCATENATE(Matriz!A117,\" - P4 I5\"),\"\")","v":""},{"$f":"IF(CONCATENATE(C$22,Y$3)=Matriz!$AU$162,CONCATENATE(Matriz!A162,\" - P4 I5\"),\"\")","v":""},{"$f":"IF(CONCATENATE(C$22,Y$3)=Matriz!$AU$207,CONCATENATE(Matriz!A207,\" - P4 I5\"),\"\")","v":""},null,null,null,null,null,9,18,162]
[null,null,null,null,{"$f":"IF(CONCATENATE(C$22,E$3)=Matriz!$AU$36,CONCATENATE(Matriz!A36,\" - P4 I1\"),\"\")","v":""},{"$f":"IF(CONCATENATE(C$22,E$3)=Matriz!$AU$81,CONCATENATE(Matriz!A81,\" - P4 I1\"),\"\")","v":""},{"$f":"IF(CONCATENATE(C$22,E$3)=Matriz!$AU$126,CONCATENATE(Matriz!A126,\" - P4 I1\"),\"\")","v":""},{"$f":"IF(CONCATENATE(C$22,E$3)=Matriz!$AU$171,CONCATENATE(Matriz!A171,\" - P4 I1\"),\"\")","v":""},{"$f":"IF(CONCATENATE(C$22,E$3)=Matriz!$AU$216,CONCATENATE(Matriz!A216,\" - P4 I1\"),\"\")","v":""},{"$f":"IF(CONCATENATE(C$22,J$3)=Matriz!$AU$36,CONCATENATE(Matriz!#REF!,\" - P4 I2\"),\"\")","v":""},{"$f":"IF(CONCATENATE(C$22,J$3)=Matriz!$AU$81,CONCATENATE(Matriz!A81,\" - P4 I2\"),\"\")","v":""},{"$f":"IF(CONCATENATE(C$22,J$3)=Matriz!$AU$126,CONCATENATE(Matriz!A126,\" - P4 I2\"),\"\")","v":""},{"$f":"IF(CONCATENATE(C$22,J$3)=Matriz!$AU$171,CONCATENATE(Matriz!A171,\" - P4 I2\"),\"\")","v":""},{"$f":"IF(CONCATENATE(C$22,J$3)=Matriz!$AU$216,CONCATENATE(Matriz!A216,\" - P4 I2\"),\"\")","v":""},{"$f":"IF(CONCATENATE(C$22,O$3)=Matriz!$AU$36,CONCATENATE(Matriz!A36,\" - P4 I3\"),\"\")","v":""},{"$f":"IF(CONCATENATE(D$22,P$3)=Matriz!$AU$81,CONCATENATE(Matriz!B81,\" - P4 I3\"),\"\")","v":""},{"$f":"IF(CONCATENATE(D$22,P$3)=Matriz!$AU$126,CONCATENATE(Matriz!B126,\" - P4 I3\"),\"\")","v":""},{"$f":"IF(CONCATENATE(D$22,P$3)=Matriz!$AU$171,CONCATENATE(Matriz!B171,\" - P4 I3\"),\"\")","v":""},{"$f":"IF(CONCATENATE(D$22,P$3)=Matriz!$AU$216,CONCATENATE(Matriz!B216,\" - P4 I3\"),\"\")","v":""},{"$f":"IF(CONCATENATE(C$22,T$3)=Matriz!$AU$36,CONCATENATE(Matriz!A36,\" - P4 I4\"),\"\")","v":""},{"$f":"IF(CONCATENATE(C$22,T$3)=Matriz!$AU$81,CONCATENATE(Matriz!A81,\" - P4 I4\"),\"\")","v":""},{"$f":"IF(CONCATENATE(C$22,T$3)=Matriz!$AU$126,CONCATENATE(Matriz!A126,\" - P4 I4\"),\"\")","v":""},{"$f":"IF(CONCATENATE(C$22,T$3)=Matriz!$AU$171,CONCATENATE(Matriz!A171,\" - P4 I4\"),\"\")","v":""},{"$f":"IF(CONCATENATE(C$22,T$3)=Matriz!$AU$216,CONCATENATE(Matriz!A216,\" - P4 I4\"),\"\")","v":""},{"$f":"IF(CONCATENATE(C$22,Y$3)=Matriz!$AU$36,CONCATENATE(Matriz!A36,\" - P4 I5\"),\"\")","v":""},{"$f":"IF(CONCATENATE(C$22,Y$3)=Matriz!$AU$81,CONCATENATE(Matriz!A81,\" - P4 I5\"),\"\")","v":""},{"$f":"IF(CONCATENATE(C$22,Y$3)=Matriz!$AU$126,CONCATENATE(Matriz!A126,\" - P4 I5\"),\"\")","v":""},{"$f":"IF(CONCATENATE(C$22,Y$3)=Matriz!$AU$171,CONCATENATE(Matriz!A171,\" - P4 I5\"),\"\")","v":""},{"$f":"IF(CONCATENATE(C$22,Y$3)=Matriz!$AU$216,CONCATENATE(Matriz!A216,\" - P4 I5\"),\"\")","v":""},null,null,null,null,null,9,19,171]
[null,null,null,null,{"$f":"IF(CONCATENATE(C$22,E$3)=Matriz!$AU$45,CONCATENATE(Matriz!A45,\" - P4 I1\"),\"\")","v":""},{"$f":"IF(CONCATENATE(C$22,E$3)=Matriz!$AU$90,CONCATENATE(Matriz!A90,\" - P4 I1\"),\"\")","v":""},{"$f":"IF(CONCATENATE(C$22,E$3)=Matriz!$AU$135,CONCATENATE(Matriz!A135,\" - P4 I1\"),\"\")","v":""},{"$f":"IF(CONCATENATE(C$22,E$3)=Matriz!$AU$180,CONCATENATE(Matriz!A180,\" - P4 I1\"),\"\")","v":""},{"$f":"IF(CONCATENATE(C$22,E$3)=Matriz!$AU$225,CONCATENATE(Matriz!A225,\" - P4 I1\"),\"\")","v":""},{"$f":"IF(CONCATENATE(C$22,J$3)=Matriz!$AU$45,CONCATENATE(Matriz!A45,\" - P4 I2\"),\"\")","v":""},{"$f":"IF(CONCATENATE(C$22,J$3)=Matriz!$AU$90,CONCATENATE(Matriz!A90,\" - P4 I2\"),\"\")","v":""},{"$f":"IF(CONCATENATE(C$22,J$3)=Matriz!$AU$135,CONCATENATE(Matriz!A135,\" - P4 I2\"),\"\")","v":""},{"$f":"IF(CONCATENATE(C$22,J$3)=Matriz!$AU$180,CONCATENATE(Matriz!A180,\" - P4 I2\"),\"\")","v":""},{"$f":"IF(CONCATENATE(C$22,J$3)=Matriz!$AU$225,CONCATENATE(Matriz!A225,\" - P4 I2\"),\"\")","v":""},{"$f":"IF(CONCATENATE(C$22,O$3)=Matriz!$AU$45,CONCATENATE(Matriz!A45,\" - P4 I3\"),\"\")","v":""},{"$f":"IF(CONCATENATE(D$22,P$3)=Matriz!$AU$90,CONCATENATE(Matriz!B90,\" - P4 I3\"),\"\")","v":""},{"$f":"IF(CONCATENATE(D$22,P$3)=Matriz!$AU$135,CONCATENATE(Matriz!B135,\" - P4 I3\"),\"\")","v":""},{"$f":"IF(CONCATENATE(D$22,P$3)=Matriz!$AU$180,CONCATENATE(Matriz!B180,\" - P4 I3\"),\"\")","v":""},{"$f":"IF(CONCATENATE(D$22,P$3)=Matriz!$AU$225,CONCATENATE(Matriz!B225,\" - P4 I3\"),\"\")","v":""},{"$f":"IF(CONCATENATE(C$22,T$3)=Matriz!$AU$45,CONCATENATE(Matriz!A45,\" - P4 I4\"),\"\")","v":""},{"$f":"IF(CONCATENATE(C$22,T$3)=Matriz!$AU$90,CONCATENATE(Matriz!A90,\" - P4 I4\"),\"\")","v":""},{"$f":"IF(CONCATENATE(C$22,T$3)=Matriz!$AU$135,CONCATENATE(Matriz!A135,\" - P4 I4\"),\"\")","v":""},{"$f":"IF(CONCATENATE(C$22,T$3)=Matriz!$AU$180,CONCATENATE(Matriz!A180,\" - P4 I4\"),\"\")","v":""},{"$f":"IF(CONCATENATE(C$22,T$3)=Matriz!$AU$225,CONCATENATE(Matriz!A225,\" - P4 I4\"),\"\")","v":""},{"$f":"IF(CONCATENATE(C$22,Y$3)=Matriz!$AU$45,CONCATENATE(Matriz!A45,\" - P4 I5\"),\"\")","v":""},{"$f":"IF(CONCATENATE(C$22,Y$3)=Matriz!$AU$90,CONCATENATE(Matriz!A90,\" - P4 I5\"),\"\")","v":""},{"$f":"IF(CONCATENATE(C$22,Y$3)=Matriz!$AU$135,CONCATENATE(Matriz!A135,\" - P4 I5\"),\"\")","v":""},{"$f":"IF(CONCATENATE(C$22,Y$3)=Matriz!$AU$180,CONCATENATE(Matriz!A180,\" - P4 I5\"),\"\")","v":""},{"$f":"IF(CONCATENATE(C$22,Y$3)=Matriz!$AU$225,CONCATENATE(Matriz!A225,\" - P4 I5\"),\"\")","v":""},null,null,null,null,null,9,20,180]
[null,null,null,null,{"$f":"IF(CONCATENATE(C$27,E$3)=Matriz!$AU$9,CONCATENATE(Matriz!A$9,\" - P5 I1\"),\"\")","v":""},{"$f":"IF(CONCATENATE($C$27,E$3)=Matriz!$AU$54,CONCATENATE(Matriz!A$54,\" - P5 I1\"),\"\")","v":""},{"$f":"IF(CONCATENATE($C$27,E$3)=Matriz!$AU$99,CONCATENATE(Matriz!A$99,\" - P5 I1\"),\"\")","v":""},{"$f":"IF(CONCATENATE($C$27,E$3)=Matriz!$AU$144,CONCATENATE(Matriz!A$144,\" - P5 I1\"),\"\")","v":""},{"$f":"IF(CONCATENATE($C$27,E$3)=Matriz!$AU$189,CONCATENATE(Matriz!A$189,\" - P5 I1\"),\"\")","v":""},{"$f":"IF(CONCATENATE(C$27,J$3)=Matriz!$AU$9,CONCATENATE(Matriz!A$9,\" - P5 I2\"),\"\")","v":""},{"$f":"IF(CONCATENATE($C$27,J$3)=Matriz!$AU$54,CONCATENATE(Matriz!A$54,\" - P5 I2\"),\"\")","v":""},{"$f":"IF(CONCATENATE($C$27,J$3)=Matriz!$AU$99,CONCATENATE(Matriz!A$99,\" - P5 I2\"),\"\")","v":""},{"$f":"IF(CONCATENATE($C$27,J$3)=Matriz!$AU$144,CONCATENATE(Matriz!A$144,\" - P5 I2\"),\"\")","v":""},{"$f":"IF(CONCATENATE($C$27,J$3)=Matriz!$AU$189,CONCATENATE(Matriz!A$189,\" - P5 I2\"),\"\")","v":""},{"$f":"IF(CONCATENATE(C$27,O$3)=Matriz!$AU$9,CONCATENATE(Matriz!A$9,\" - P5 I3\"),\"\")","v":""},{"$f":"IF(CONCATENATE($C$27,O$3)=Matriz!$AU$54,CONCATENATE(Matriz!A$54,\" - P5 I3\"),\"\")","v":""},{"$f":"IF(CONCATENATE($C$27,O$3)=Matriz!$AU$99,CONCATENATE(Matriz!A$99,\" - P5 I3\"),\"\")","v":"R11\nGESTIÓN ADMINISTRATIVA Y FINANCIERA\n TESORERÍA - P5 I3"},{"$f":"IF(CONCATENATE($C$27,O$3)=Matriz!$AU$144,CONCATENATE(Matriz!A$144,\" - P5 I3\"),\"\")","v":""},{"$f":"IF(CONCATENATE($C$27,O$3)=Matriz!$AU$189,CONCATENATE(Matriz!A$189,\" - P5 I3\"),\"\")","v":""},{"$f":"IF(CONCATENATE($C$27,T$3)=Matriz!$AU$9,CONCATENATE(Matriz!A$9,\" - P5 I4\"),\"\")","v":"R1\nDIRECCIÓN ESTRATÉGICA - P5 I4"},{"$f":"IF(CONCATENATE($C$27,T$3)=Matriz!$AU$54,CONCATENATE(Matriz!A$54,\" - P5 I4\"),\"\")","v":""},{"$f":"IF(CONCATENATE($C$27,T$3)=Matriz!$AU$99,CONCATENATE(Matriz!A$99,\" - P5 I4\"),\"\")","v":""},{"$f":"IF(CONCATENATE($C$27,T$3)=Matriz!$AU$144,CONCATENATE(Matriz!A$144,\" - P5 I4\"),\"\")","v":""},{"$f":"IF(CONCATENATE($C$27,T$3)=Matriz!$AU$189,CONCATENATE(Matriz!A$189,\" - P5 I4\"),\"\")","v":""},{"$f":"IF(CONCATENATE($C$27,Y$3)=Matriz!$AU$9,CONCATENATE(Matriz!A$9,\" - P5 I5\"),\"\")","v":""},{"$f":"IF(CONCATENATE($C$27,Y$3)=Matriz!$AU$54,CONCATENATE(Matriz!A$54,\" - P5 I5\"),\"\")","v":"R6\nGESTIÓN ADMINISTRATIVA Y FINANCIERA \nCONTABILIDAD - P5 I5"},{"$f":"IF(CONCATENATE($C$27,Y$3)=Matriz!$AU$99,CONCATENATE(Matriz!A$99,\" - P5 I5\"),\"\")","v":""},{"$f":"IF(CONCATENATE($C$27,Y$3)=Matriz!$AU$144,CONCATENATE(Matriz!A$144,\" - P5 I5\"),\"\")","v":""},{"$f":"IF(CONCATENATE($C$27,Y$3)=Matriz!$AU$189,CONCATENATE(Matriz!A$189,\" - P5 I5\"),\"\")","v":""},null,null,null,null,null,9,21,189]
[null,null,1,"RARA VEZ",{"$f":"IF(CONCATENATE($C$27,E$3)=Matriz!$AU$18,CONCATENATE(Matriz!A$18,\" - P5 I1\"),\"\")","v":""},{"$f":"IF(CONCATENATE($C$27,E$3)=Matriz!$AU$63,CONCATENATE(Matriz!A$63,\" - P5 I1\"),\"\")","v":""},{"$f":"IF(CONCATENATE($C$27,E$3)=Matriz!$AU$108,CONCATENATE(Matriz!A$108,\" - P5 I1\"),\"\")","v":""},{"$f":"IF(CONCATENATE($C$27,E$3)=Matriz!$AU$153,CONCATENATE(Matriz!A$153,\" - P5 I1\"),\"\")","v":""},{"$f":"IF(CONCATENATE($C$27,E$3)=Matriz!$AU$198,CONCATENATE(Matriz!A$198,\" - P5 I1\"),\"\")","v":""},{"$f":"IF(CONCATENATE($C$27,J$3)=Matriz!$AU$18,CONCATENATE(Matriz!A$18,\" - P5 I2\"),\"\")","v":""},{"$f":"IF(CONCATENATE($C$27,J$3)=Matriz!$AU$63,CONCATENATE(Matriz!A$63,\" - P5 I2\"),\"\")","v":""},{"$f":"IF(CONCATENATE($C$27,J$3)=Matriz!$AU$108,CONCATENATE(Matriz!A$108,\" - P5 I2\"),\"\")","v":""},{"$f":"IF(CONCATENATE($C$27,J$3)=Matriz!$AU$153,CONCATENATE(Matriz!A$153,\" - P5 I2\"),\"\")","v":""},{"$f":"IF(CONCATENATE($C$27,J$3)=Matriz!$AU$198,CONCATENATE(Matriz!A$198,\" - P5 I2\"),\"\")","v":""},{"$f":"IF(CONCATENATE($C$27,O$3)=Matriz!$AU$18,CONCATENATE(Matriz!A$18,\" - P5 I3\"),\"\")","v":""},{"$f":"IF(CONCATENATE($C$27,O$3)=Matriz!$AU$63,CONCATENATE(Matriz!A$63,\" - P5 I3\"),\"\")","v":""},{"$f":"IF(CONCATENATE($C$27,O$3)=Matriz!$AU$108,CONCATENATE(Matriz!A$108,\" - P5 I3\"),\"\")","v":""},{"$f":"IF(CONCATENATE($C$27,O$3)=Matriz!$AU$153,CONCATENATE(Matriz!A$153,\" - P5 I3\"),\"\")","v":""},{"$f":"IF(CONCATENATE($C$27,O$3)=Matriz!$AU$198,CONCATENATE(Matriz!A$198,\" - P5 I3\"),\"\")","v":""},{"$f":"IF(CONCATENATE($C$27,T$3)=Matriz!$AU$18,CONCATENATE(Matriz!A$18,\" - P5 I4\"),\"\")","v":"R2\nDIRECCIÓN ESTRATÉGICA - P5 I4"},{"$f":"IF(CONCATENATE($C$27,T$3)=Matriz!$AU$63,CONCATENATE(Matriz!A$63,\" - P5 I4\"),\"\")","v":""},{"$f":"IF(CONCATENATE($C$27,T$3)=Matriz!$AU$108,CONCATENATE(Matriz!A$108,\" - P5 I4\"),\"\")","v":"R12\nGESTIÓN JURÍDICA - P5 I4"},{"$f":"IF(CONCATENATE($C$27,T$3)=Matriz!$AU$153,CONCATENATE(Matriz!A$153,\" - P5 I4\"),\"\")","v":""},{"$f":"IF(CONCATENATE($C$27,T$3)=Matriz!$AU$198,CONCATENATE(Matriz!A$198,\" - P5 I4\"),\"\")","v":""},{"$f":"IF(CONCATENATE($C$27,Y$3)=Matriz!$AU$18,CONCATENATE(Matriz!A$18,\" - P5 I5\"),\"\")","v":""},{"$f":"IF(CONCATENATE($C$27,Y$3)=Matriz!$AU$63,CONCATENATE(Matriz!A$63,\" - P5 I5\"),\"\")","v":"R7\nGESTIÓN ADMINISTRATIVA Y FINANCIERA \nALMACÈN - P5 I5"},{"$f":"IF(CONCATENATE($C$27,Y$3)=Matriz!$AU$108,CONCATENATE(Matriz!A$108,\" - P5 I5\"),\"\")","v":""},{"$f":"IF(CONCATENATE($C$27,Y$3)=Matriz!$AU$153,CONCATENATE(Matriz!A$153,\" - P5 I5\"),\"\")","v":""},{"$f":"IF(CONCATENATE($C$27,Y$3)=Matriz!$AU$198,CONCATENATE(Matriz!A$198,\" - P5 I5\"),\"\")","v":""},null,null,null,null,null,9,22,198]
[null,null,null,null,{"$f":"IF(CONCATENATE($C$27,E$3)=Matriz!$AU$27,CONCATENATE(Matriz!A$27,\" - P5 I1\"),\"\")","v":""},{"$f":"IF(CONCATENATE($C$27,E$3)=Matriz!$AU$72,CONCATENATE(Matriz!A$72,\" - P5 I1\"),\"\")","v":""},{"$f":"IF(CONCATENATE($C$27,E$3)=Matriz!$AU$117,CONCATENATE(Matriz!A$117,\" - P5 I1\"),\"\")","v":""},{"$f":"IF(CONCATENATE($C$27,E$3)=Matriz!$AU$162,CONCATENATE(Matriz!A$162,\" - P5 I1\"),\"\")","v":""},{"$f":"IF(CONCATENATE($C$27,E$3)=Matriz!$AU$207,CONCATENATE(Matriz!A$207,\" - P5 I1\"),\"\")","v":""},{"$f":"IF(CONCATENATE($C$27,J$3)=Matriz!$AU$27,CONCATENATE(Matriz!A$27,\" - P5 I2\"),\"\")","v":""},{"$f":"IF(CONCATENATE($C$27,J$3)=Matriz!$AU$72,CONCATENATE(Matriz!A$72,\" - P5 I2\"),\"\")","v":""},{"$f":"IF(CONCATENATE($C$27,J$3)=Matriz!$AU$117,CONCATENATE(Matriz!A$117,\" - P5 I2\"),\"\")","v":""},{"$f":"IF(CONCATENATE($C$27,J$3)=Matriz!$AU$162,CONCATENATE(Matriz!A$162,\" - P5 I2\"),\"\")","v":""},{"$f":"IF(CONCATENATE($C$27,J$3)=Matriz!$AU$207,CONCATENATE(Matriz!A$207,\" - P5 I2\"),\"\")","v":""},{"$f":"IF(CONCATENATE($C$27,O$3)=Matriz!$AU$27,CONCATENATE(Matriz!A$27,\" - P5 I3\"),\"\")","v":""},{"$f":"IF(CONCATENATE($C$27,O$3)=Matriz!$AU$72,CONCATENATE(Matriz!A$72,\" - P5 I3\"),\"\")","v":""},{"$f":"IF(CONCATENATE($C$27,O$3)=Matriz!$AU$117,CONCATENATE(Matriz!A$117,\" - P5 I3\"),\"\")","v":""},{"$f":"IF(CONCATENATE($C$27,O$3)=Matriz!$AU$162,CONCATENATE(Matriz!A$162,\" - P5 I3\"),\"\")","v":""},{"$f":"IF(CONCATENATE($C$27,O$3)=Matriz!$AU$207,CONCATENATE(Matriz!A$207,\" - P5 I3\"),\"\")","v":""},{"$f":"IF(CONCATENATE($C$27,T$3)=Matriz!$AU$27,CONCATENATE(Matriz!A$27,\" - P5 I4\"),\"\")","v":"R3\nPLANEACIÓN INSTITUCIONAL\n - P5 I4"},{"$f":"IF(CONCATENATE($C$27,T$3)=Matriz!$AU$72,CONCATENATE(Matriz!A$72,\" - P5 I4\"),\"\")","v":""},{"$f":"IF(CONCATENATE($C$27,T$3)=Matriz!$AU$117,CONCATENATE(Matriz!A$117,\" - P5 I4\"),\"\")","v":"R13\nGESTIÓN JURÍDICA - P5 I4"},{"$f":"IF(CONCATENATE($C$27,T$3)=Matriz!$AU$162,CONCATENATE(Matriz!A$162,\" - P5 I4\"),\"\")","v":""},{"$f":"IF(CONCATENATE($C$27,T$3)=Matriz!$AU$207,CONCATENATE(Matriz!A$207,\" - P5 I4\"),\"\")","v":""},{"$f":"IF(CONCATENATE($C$27,Y$3)=Matriz!$AU$27,CONCATENATE(Matriz!A$27,\" - P5 I5\"),\"\")","v":""},{"$f":"IF(CONCATENATE($C$27,Y$3)=Matriz!$AU$72,CONCATENATE(Matriz!A$72,\" - P5 I5\"),\"\")","v":"R8\nGESTIÓN ADMINISTRATIVA Y FINANCIERA\n GESTIÓN  DOCUMENTAL - P5 I5"},{"$f":"IF(CONCATENATE($C$27,Y$3)=Matriz!$AU$117,CONCATENATE(Matriz!A$117,\" - P5 I5\"),\"\")","v":""},{"$f":"IF(CONCATENATE($C$27,Y$3)=Matriz!$AU$162,CONCATENATE(Matriz!A$162,\" - P5 I5\"),\"\")","v":""},{"$f":"IF(CONCATENATE($C$27,Y$3)=Matriz!$AU$207,CONCATENATE(Matriz!A$207,\" - P5 I5\"),\"\")","v":""},null,null,null,null,null,9,23,207]
[null,null,null,null,{"$f":"IF(CONCATENATE($C$27,E$3)=Matriz!$AU$36,CONCATENATE(Matriz!A$36,\" - P5 I1\"),\"\")","v":""},{"$f":"IF(CONCATENATE($C$27,E$3)=Matriz!$AU$81,CONCATENATE(Matriz!A$81,\" - P5 I1\"),\"\")","v":""},{"$f":"IF(CONCATENATE($C$27,E$3)=Matriz!$AU$126,CONCATENATE(Matriz!A$126,\" - P5 I1\"),\"\")","v":""},{"$f":"IF(CONCATENATE($C$27,E$3)=Matriz!$AU$171,CONCATENATE(Matriz!A$171,\" - P5 I1\"),\"\")","v":""},{"$f":"IF(CONCATENATE($C$27,E$3)=Matriz!$AU$216,CONCATENATE(Matriz!A$216,\" - P5 I1\"),\"\")","v":""},{"$f":"IF(CONCATENATE($C$27,J$3)=Matriz!$AU$36,CONCATENATE(Matriz!A$36,\" - P5 I2\"),\"\")","v":""},{"$f":"IF(CONCATENATE($C$27,J$3)=Matriz!$AU$81,CONCATENATE(Matriz!A$81,\" - P5 I2\"),\"\")","v":""},{"$f":"IF(CONCATENATE($C$27,J$3)=Matriz!$AU$126,CONCATENATE(Matriz!A$126,\" - P5 I2\"),\"\")","v":""},{"$f":"IF(CONCATENATE($C$27,J$3)=Matriz!$AU$171,CONCATENATE(Matriz!A$171,\" - P5 I2\"),\"\")","v":""},{"$f":"IF(CONCATENATE($C$27,J$3)=Matriz!$AU$216,CONCATENATE(Matriz!A$216,\" - P5 I2\"),\"\")","v":""},{"$f":"IF(CONCATENATE($C$27,O$3)=Matriz!$AU$36,CONCATENATE(Matriz!A$36,\" - P5 I3\"),\"\")","v":""},{"$f":"IF(CONCATENATE($C$27,O$3)=Matriz!$AU$81,CONCATENATE(Matriz!A$81,\" - P5 I3\"),\"\")","v":""},{"$f":"IF(CONCATENATE($C$27,O$3)=Matriz!$AU$126,CONCATENATE(Matriz!A$126,\" - P5 I3\"),\"\")","v":""},{"$f":"IF(CONCATENATE($C$27,O$3)=Matriz!$AU$171,CONCATENATE(Matriz!A$171,\" - P5 I3\"),\"\")","v":""},{"$f":"IF(CONCATENATE($C$27,O$3)=Matriz!$AU$216,CONCATENATE(Matriz!A$216,\" - P5 I3\"),\"\")","v":""},{"$f":"IF(CONCATENATE($C$27,T$3)=Matriz!$AU$36,CONCATENATE(Matriz!A$36,\" - P5 I4\"),\"\")","v":"R4\nGESTIÓN TÉCNICA\n - P5 I4"},{"$f":"IF(CONCATENATE($C$27,T$3)=Matriz!$AU$81,CONCATENATE(Matriz!A$81,\" - P5 I4\"),\"\")","v":"R9\nGESTIÓN ADMINISTRATIVA Y FINANCIERA\n TALENTO HUMANO - P5 I4"},{"$f":"IF(CONCATENATE($C$27,T$3)=Matriz!$AU$126,CONCATENATE(Matriz!A$126,\" - P5 I4\"),\"\")","v":""},{"$f":"IF(CONCATENATE($C$27,T$3)=Matriz!$AU$171,CONCATENATE(Matriz!A$171,\" - P5 I4\"),\"\")","v":""},{"$f":"IF(CONCATENATE($C$27,T$3)=Matriz!$AU$216,CONCATENATE(Matriz!A$216,\" - P5 I4\"),\"\")","v":""},{"$f":"IF(CONCATENATE($C$27,Y$3)=Matriz!$AU$36,CONCATENATE(Matriz!A$36,\" - P5 I5\"),\"\")","v":""},{"$f":"IF(CONCATENATE($C$27,Y$3)=Matriz!$AU$81,CONCATENATE(Matriz!A$81,\" - P5 I5\"),\"\")","v":""},{"$f":"IF(CONCATENATE($C$27,Y$3)=Matriz!$AU$126,CONCATENATE(Matriz!A$126,\" - P5 I5\"),\"\")","v":""},{"$f":"IF(CONCATENATE($C$27,Y$3)=Matriz!$AU$171,CONCATENATE(Matriz!A$171,\" - P5 I5\"),\"\")","v":""},{"$f":"IF(CONCATENATE($C$27,Y$3)=Matriz!$AU$216,CONCATENATE(Matriz!A$216,\" - P5 I5\"),\"\")","v":""},null,null,null,null,null,9,24,216]
[null,null,null,null,{"$f":"IF(CONCATENATE($C$27,E$3)=Matriz!$AU$45,CONCATENATE(Matriz!A$45,\" - P5 I1\"),\"\")","v":""},{"$f":"IF(CONCATENATE($C$27,E$3)=Matriz!$AU$90,CONCATENATE(Matriz!A$90,\" - P5 I1\"),\"\")","v":""},{"$f":"IF(CONCATENATE($C$27,E$3)=Matriz!$AU$135,CONCATENATE(Matriz!A$135,\" - P5 I1\"),\"\")","v":""},{"$f":"IF(CONCATENATE($C$27,E$3)=Matriz!$AU$180,CONCATENATE(Matriz!A$180,\" - P5 I1\"),\"\")","v":""},{"$f":"IF(CONCATENATE($C$27,E$3)=Matriz!$AU$225,CONCATENATE(Matriz!A$225,\" - P5 I1\"),\"\")","v":""},{"$f":"IF(CONCATENATE($C$27,J$3)=Matriz!$AU$45,CONCATENATE(Matriz!A$45,\" - P5 I2\"),\"\")","v":""},{"$f":"IF(CONCATENATE($C$27,J$3)=Matriz!$AU$90,CONCATENATE(Matriz!A$90,\" - P5 I2\"),\"\")","v":""},{"$f":"IF(CONCATENATE($C$27,J$3)=Matriz!$AU$135,CONCATENATE(Matriz!A$135,\" - P5 I2\"),\"\")","v":""},{"$f":"IF(CONCATENATE($C$27,J$3)=Matriz!$AU$180,CONCATENATE(Matriz!A$180,\" - P5 I2\"),\"\")","v":""},{"$f":"IF(CONCATENATE($C$27,J$3)=Matriz!$AU$225,CONCATENATE(Matriz!A$225,\" - P5 I2\"),\"\")","v":""},{"$f":"IF(CONCATENATE($C$27,O$3)=Matriz!$AU$45,CONCATENATE(Matriz!A$45,\" - P5 I3\"),\"\")","v":""},{"$f":"IF(CONCATENATE($C$27,O$3)=Matriz!$AU$90,CONCATENATE(Matriz!A$90,\" - P5 I3\"),\"\")","v":""},{"$f":"IF(CONCATENATE($C$27,O$3)=Matriz!$AU$135,CONCATENATE(Matriz!A$135,\" - P5 I3\"),\"\")","v":""},{"$f":"IF(CONCATENATE($C$27,O$3)=Matriz!$AU$180,CONCATENATE(Matriz!A$180,\" - P5 I3\"),\"\")","v":""},{"$f":"IF(CONCATENATE($C$27,O$3)=Matriz!$AU$225,CONCATENATE(Matriz!A$225,\" - P5 I3\"),\"\")","v":""},{"$f":"IF(CONCATENATE($C$27,T$3)=Matriz!$AU$45,CONCATENATE(Matriz!A$45,\" - P5 I4\"),\"\")","v":"R5\nSISTEMAS DE INFORMACIÓN Y COMUNICACIÓN - P5 I4"},{"$f":"IF(CONCATENATE($C$27,T$3)=Matriz!$AU$90,CONCATENATE(Matriz!A$90,\" - P5 I4\"),\"\")","v":""},{"$f":"IF(CONCATENATE($C$27,T$3)=Matriz!$AU$135,CONCATENATE(Matriz!A$135,\" - P5 I4\"),\"\")","v":""},{"$f":"IF(CONCATENATE($C$27,T$3)=Matriz!$AU$180,CONCATENATE(Matriz!A$180,\" - P5 I4\"),\"\")","v":""},{"$f":"IF(CONCATENATE($C$27,T$3)=Matriz!$AU$225,CONCATENATE(Matriz!A$225,\" - P5 I4\"),\"\")","v":""},{"$f":"IF(CONCATENATE($C$27,Y$3)=Matriz!$AU$45,CONCATENATE(Matriz!A$45,\" - P5 I5\"),\"\")","v":""},{"$f":"IF(CONCATENATE($C$27,Y$3)=Matriz!$AU$90,CONCATENATE(Matriz!A$90,\" - P5 I5\"),\"\")","v":"R10\nCONTROL INTERNO - P5 I5"},{"$f":"IF(CONCATENATE($C$27,Y$3)=Matriz!$AU$135,CONCATENATE(Matriz!A$135,\" - P5 I5\"),\"\")","v":""},{"$f":"IF(CONCATENATE($C$27,Y$3)=Matriz!$AU$180,CONCATENATE(Matriz!A$180,\" - P5 I5\"),\"\")","v":""},{"$f":"IF(CONCATENATE($C$27,Y$3)=Matriz!$AU$225,CONCATENATE(Matriz!A$225,\" - P5 I5\"),\"\")","v":""},null,null,null,null,null,9,25,225]